program: Gaussian 09
title: 000222602
version: EM64L-G09RevD.01
frameworkgroup: C1[X(C14H16N2O2)]
method: RPBEPBE
basis: SDD
operation: Freq
keyword: #p
keyword: freq=noraman
keyword: PBEPBE/SDD
title: #p freq=noraman PBEPBE/SDD
converged: YES YES NO NO
title: Mulliken charges:
elementType: O O N N C C C C C C C C C C C C C C H H H H H H H H H H H H H H H H
charge: -0.247958 -0.313396 -0.168846 -0.119393 0.252381 0.146715 0.218463 -0.330052 -0.372275 -0.348741 -0.381027 -0.029134 -0.660083 -0.230968 -0.242137 0.162423 -0.622798 -0.600981 0.309985 0.228325 0.230943 0.235104 0.287258 0.233118 0.222833 0.238202 0.223178 0.225099 0.229734 0.280323 0.224305 0.241797 0.208513 0.269089
chargesum: 0.00000
title: Mulliken charges with hydrogens summed into heavy atoms:
elementType: O O N N C C C C C C C C C C C C C C
charge: -0.247958 -0.313396 -0.168846 -0.119393 0.252381 0.146715 0.218463 -0.020066 0.086992 -0.113637 -0.093769 -0.029134 0.034070 -0.007790 -0.017039 0.162423 0.111565 0.118419
polarizability: 2.58146455e+02 5.38846432e-01 1.92551411e+02 -2.89035609e+00 -7.38028714e+00 9.55846367e+01
1716.lowfreq: -12.3575 -8.9280 -4.4040 -0.0003 0.0002 0.0006 27.3718 35.5750 57.5609
frequency: 27.2942 35.3798 57.5582 66.2843 86.2911 94.1635 119.7284 124.9528 131.9854 183.2182 209.0130 223.2978 236.2215 257.3962 261.6531 288.6991 345.3961 367.1469 403.9186 428.1637 434.3415 446.9517 520.9133 528.7280 568.6982 588.3152 609.2000 629.9894 682.8677 730.4174 751.7440 760.0635 765.2482 786.0695 797.5404 818.3953 857.6761 865.6703 933.8730 945.7742 959.7573 989.3502 1011.8410 1045.5975 1053.6204 1078.6211 1091.5936 1094.9335 1121.9199 1134.0144 1140.5106 1157.3482 1169.1665 1211.0506 1231.4236 1240.2515 1268.9930 1329.0350 1346.8226 1368.0307 1375.8529 1388.8936 1393.5541 1407.4956 1408.9995 1440.8888 1454.2648 1455.5224 1467.9554 1468.5645 1476.1918 1477.7320 1486.4313 1489.4377 1492.6541 1507.2504 1550.8847 1561.4164 1586.6936 1623.5773 2970.0856 2979.0580 2992.6004 3008.9484 3047.3551 3051.6042 3066.3152 3092.3407 3101.6256 3120.4171 3128.1346 3140.9731 3146.5312 3159.3341 3183.2869 3237.6612
redmass: 3.8429 4.2989 2.8816 1.8161 3.4727 1.8431 1.6870 4.8233 1.8280 1.7088 2.4019 4.3161 4.0589 3.6954 2.4818 2.4775 6.3356 4.8917 3.2822 2.9128 3.6851 5.9898 5.4311 4.8898 4.4122 4.3827 4.4410 3.9126 7.4042 4.1249 1.9040 2.4383 4.7616 4.5283 1.2766 5.3627 1.4911 1.4776 2.9254 1.3715 2.8801 1.3105 2.1089 3.5718 1.4229 2.3164 1.2316 1.8398 1.6912 1.8278 1.3927 1.6343 1.1872 2.1140 3.9413 2.1325 1.4440 2.5250 1.4013 3.0636 2.9393 2.6275 1.3131 1.2163 4.8251 1.2285 2.7716 1.0794 1.0604 1.0649 3.1904 1.1793 1.0794 1.1675 1.2268 3.9146 7.5158 5.0450 7.1203 7.5759 1.0357 1.0377 1.0356 1.0618 1.1014 1.1020 1.1020 1.0995 1.1022 1.0977 1.0856 1.0912 1.0959 1.0975 1.0964 1.0990
irintensity: 6.8203 0.6811 0.8350 1.9211 0.2144 0.2040 0.2700 0.8434 0.3273 1.1930 2.1267 5.3940 4.2872 2.5202 5.0975 1.7597 16.9372 13.1343 2.7887 7.9692 1.4740 11.8825 4.2608 0.3903 10.0628 0.1832 11.4041 8.5186 12.5107 12.0082 49.8107 55.7664 13.3083 29.3698 15.5279 34.8579 14.8608 0.6730 6.8131 3.0057 35.5470 0.9407 15.2037 42.8735 7.7265 87.5976 0.2922 23.2472 91.5242 30.3138 0.1769 48.3503 8.8745 41.9750 15.1836 34.5022 1.2426 10.5812 19.9536 68.9211 83.8062 29.4136 15.4040 35.7124 44.0382 3.8966 39.9017 22.2793 11.1098 7.0836 26.4290 7.7429 20.3265 17.3436 6.1003 4.2226 639.7605 92.8383 3.6899 9.0785 41.9520 117.6377 21.7137 34.2869 42.6152 23.1727 1.9670 42.7146 27.0256 2.2656 0.3508 21.3767 7.3074 28.4862 7.4482 13.3982
temp: 298.150 k
press: 1.00000 atm
elementType: 8 8 7 7 6 6 6 6 6 6 6 6 6 6 6 6 6 6 1 1 1 1 1 1 1 1 1 1 1 1 1 1 1 1
symmnumber: 1
zpe: 717488.1 jmol-1
zpe.correction: 0.273277 hartree
zpe.thermalcorrener: 0.290996 hartree
zpe.thermalcorrenthalpy: 0.291940 hartree
zpe.thermalcorrgfe: 0.226318 hartree
zpe.sumelectzpe: -801.744117 hartree
zpe.sumelectthermal: -801.726398 hartree
zpe.sumelectthermalent: -801.725454 hartree
zpe.sumelectthermalfe: -801.791076 hartree
dipole: 1.5176 2.9177 2.5525
dipole: 4.1631
quadrupole: -80.3519 -100.5414 -110.5416
quadrupole: 6.8379 -7.1866 0.1469
quadrupole: 16.7931 -3.3964 -13.3966 6.8379 -7.1866 0.1469
hfenergy: -802.0173939 hartree
pointgroup: C01 [X(C14H16N2O2)]
dipole: 0.5327719 -1.4100885 -0.6406507 debye
polarizability: 255.8227117|-3.885759|183.8929816|15.8432603|-30.2299344|106.5668096 unknown
InChI: InChI=1S/C14H16N2O2/c1-4-16-9-11(13(17)14(18)15(2)3)10-7-5-6-8-12(10)16/h5-9H,4H2,1-3H3
charge 0 multiplicity 1
34 atoms
O  -1.493963 1.847684 -0.512206
O  -2.701023 -1.134696 0.926245
N  1.487612 -1.58116 0.567164
N  -3.769433 0.021167 -0.793197
C  2.18093 -0.402096 0.197641
C  1.199924 0.594222 -0.125394
C  -0.11223 -0.027205 0.048362
C  0.127433 -1.353321 0.47174
C  2.121537 -2.856593 0.948849
C  3.567402 -0.151163 0.142335
C  1.630079 1.887101 -0.514887
C  -1.396129 0.613504 -0.191236
C  2.601104 -3.674589 -0.269327
C  3.972676 1.142611 -0.250167
C  3.015687 2.146273 -0.574514
C  -2.672389 -0.242189 0.00981
C  -5.031584 -0.686113 -0.506143
C  -3.819613 0.958987 -1.931585
H  -0.607643 -2.108274 0.741732
H  2.969902 -2.633497 1.622027
H  1.385231 -3.435505 1.533154
H  4.307808 -0.918241 0.392893
H  0.88966 2.655129 -0.751618
H  1.752976 -3.933928 -0.92652
H  3.077082 -4.612441 0.069288
H  3.337566 -3.109708 -0.86664
H  5.041286 1.378484 -0.304117
H  3.366493 3.140656 -0.872065
H  -5.842008 0.045109 -0.324508
H  -4.88904 -1.310795 0.388085
H  -5.320676 -1.328374 -1.360023
H  -4.33532 1.896137 -1.64996
H  -4.377306 0.479202 -2.758299
H  -2.812533 1.223827 -2.276019
