program: Gaussian 09
title: 000222598
version: EM64L-G09RevD.01
frameworkgroup: C1[X(C10H7N3O4S2)]
method: RPBEPBE
basis: SDD
operation: Freq
keyword: #p
keyword: freq=noraman
keyword: PBEPBE/SDD
title: #p freq=noraman PBEPBE/SDD
converged: YES YES NO NO
title: Mulliken charges:
elementType: S S O O O O N N N C C C C C C C C C C H H H H H H H
charge: 0.329343 0.156003 -0.163721 -0.216609 -0.198688 -0.196001 -0.062927 -0.373914 0.028912 -0.776540 0.338974 0.317759 0.207743 -0.505526 -0.344564 -0.327233 0.390778 -0.354415 -0.351908 0.321385 0.307298 0.341925 0.262247 0.283337 0.292455 0.293886
chargesum: 0.00000
title: Mulliken charges with hydrogens summed into heavy atoms:
elementType: S S O O O O N N N C C C C C C C C C C
charge: 0.329343 0.156003 -0.163721 -0.216609 -0.198688 -0.196001 -0.062927 -0.031989 0.028912 -0.147858 0.338974 0.317759 0.207743 -0.505526 -0.082317 -0.043896 0.390778 -0.061960 -0.058022
polarizability: 2.69741550e+02 -1.86573397e+01 1.53051409e+02 9.53708082e+00 4.94223733e+00 1.35321244e+02
1716.lowfreq: -6.3935 -2.8803 -0.0015 0.0006 0.0007 6.3290 17.8116 25.1568 41.6384
frequency: 17.6766 25.1021 41.6293 55.2915 70.8321 86.2736 92.7783 118.4893 120.1622 189.6849 221.5329 261.2077 265.0071 324.0675 339.2636 382.9403 392.7106 409.3624 425.5294 442.9015 490.1838 496.9932 500.8141 515.8694 529.2291 567.5470 622.1252 631.7443 659.2662 687.9297 699.5922 717.1222 762.4943 787.6519 853.3628 861.0606 870.4724 884.2869 889.6626 992.3781 1002.8958 1005.5711 1008.2338 1054.6316 1090.3884 1110.2590 1116.0003 1124.8055 1181.8592 1216.5140 1225.9116 1230.9607 1254.3184 1296.8745 1322.5679 1368.0317 1401.6205 1410.0148 1419.8728 1453.8477 1479.4628 1589.8346 1609.4194 1621.4786 1674.5291 3052.6767 3128.8257 3151.3531 3166.6332 3186.3385 3189.5287 3520.8000
redmass: 7.0385 11.2873 10.4307 11.6821 7.1301 9.1254 10.4787 4.8991 4.7291 11.0976 6.1657 6.9308 13.2336 5.6787 4.2192 8.1842 16.1352 2.8805 1.8623 5.3207 7.8543 7.5648 10.0136 6.9626 5.0930 4.1957 6.9839 7.3528 6.0004 4.2717 8.0752 5.7001 4.9402 9.7124 1.8299 2.7419 3.8046 1.9434 1.6523 1.3792 2.3408 3.1475 2.4404 5.3784 3.2025 1.6192 1.6698 1.7210 1.3112 5.6182 4.4565 1.4608 4.3769 1.2939 7.6914 7.0907 9.7482 3.8966 1.0826 1.5556 2.3362 8.2128 6.2976 9.5193 12.0618 1.0572 1.1066 1.0904 1.0901 1.0949 1.0966 1.0789
irintensity: 0.8313 0.0966 0.0619 1.5861 1.7778 4.8618 8.2277 3.0951 8.2581 5.5762 8.7130 2.7153 0.1645 5.9513 10.9994 8.5101 2.6639 0.2459 59.1256 25.5990 2.3381 11.7991 3.7314 2.4862 16.8831 0.5767 1.3368 24.5280 1.9324 43.6468 25.4178 11.0360 3.0295 31.5352 13.0582 10.4366 13.0989 35.2585 6.3478 1.3246 6.4334 19.1290 21.3977 48.6656 14.3006 56.4396 36.9740 43.2440 26.5167 382.8039 325.1894 89.4379 212.6378 1.4814 7.8985 84.9730 0.3269 50.5977 22.5106 181.7019 39.9474 30.1302 0.9249 92.0718 232.2750 3.2495 0.3503 4.7149 0.9900 1.4921 2.2429 33.5273
temp: 298.150 k
press: 1.00000 atm
elementType: 16 16 8 8 8 8 7 7 7 6 6 6 6 6 6 6 6 6 6 1 1 1 1 1 1 1
symmnumber: 1
zpe: 436447.3 jmol-1
zpe.correction: 0.166234 hartree
zpe.thermalcorrener: 0.183468 hartree
zpe.thermalcorrenthalpy: 0.184412 hartree
zpe.thermalcorrgfe: 0.117522 hartree
zpe.sumelectzpe: -1645.095340 hartree
zpe.sumelectthermal: -1645.078106 hartree
zpe.sumelectthermalent: -1645.077162 hartree
zpe.sumelectthermalfe: -1645.144053 hartree
dipole: 4.4484 -0.6716 -1.6096
dipole: 4.7781
quadrupole: -143.5967 -134.1928 -120.1276
quadrupole: -8.0043 -4.7206 1.0655
quadrupole: -10.9577 -1.5538 12.5114 -8.0043 -4.7206 1.0655
hfenergy: -1645.2615743 hartree
pointgroup: C01 [X(C10H7N3O4S2)]
dipole: -1.712177 0.6642468 -0.4012484 debye
dipolederiv: -0.571713 0.1312294 0.1788786 0.1124183 0.0142361 -0.0557176 0.1416383 -0.0591847 -0.046867 -0.4039243 0.1978511 0.2555835 0.0987273 -0.3328995 -0.2960806 0.1770013 -0.321104 -0.4754568 -0.4716118 -0.2805766 -0.2312656 0.025011 -0.7881784 -0.4183459 0.0042902 -0.4171916 -0.6320922 -0.7525876 -0.1462422 0.1526419 0.0091126 -0.3992439 0.2479401 -0.1879781 0.2122357 -0.6772989 -0.7473548 -0.1566831 0.1075069 -0.1505888 -0.5455051 0.1975726 0.1198361 0.2044452 -0.3435386 -0.7790098 0.1742858 -0.089437 0.1671257 -0.5315582 0.1843533 -0.0673378 0.1768638 -0.3219651 -0.3032822 0.1086817 0.2075156 -0.0886542 -0.7392558 -0.7811554 -0.1924379 -0.7469259 -0.8956127 -0.6097067 0.0981222 -0.2524276 0.3092974 -0.4402084 0.2602282 -0.5642853 0.0727551 -0.4393104 1.8815796 -0.008853 -0.0461843 -0.0099025 0.8511562 -0.3968343 -0.090804 -0.3931933 0.4259263 -0.4365969 -0.0648423 0.036305 -0.0379041 0.134971 0.0647975 0.1858534 0.0557717 0.159125 0.7757397 -0.0183479 -0.1568417 -0.2336302 1.0419515 0.6859486 -0.3174884 0.8173232 0.9051994 -0.3070262 0.003302 0.0052808 0.0131032 0.0713679 -0.0234379 -0.0089807 -0.0283637 -0.0177378 1.7046715 -0.0139454 0.1658554 -0.3739883 0.4746777 -0.5249732 0.8316161 -0.4294477 1.0336575 1.1583668 -0.0311399 -0.2366861 0.055478 0.5941027 0.8964059 -0.0768945 0.8325726 0.843688 -0.1432571 -0.1593697 0.0717088 -0.1123378 -0.0168687 -0.0413705 -0.07034 -0.0227361 -0.1144722 -0.2016447 0.1591342 -0.1095193 0.0464962 -0.0089207 -0.051922 0.0132726 -0.0720563 -0.0406551 -0.6475037 -0.0109072 0.0146219 -0.0376724 0.0848127 -0.0121621 0.0555689 -0.0098026 0.0695854 0.0490883 0.131807 -0.0843236 -0.0801567 -0.0565648 -0.0111887 0.0495218 -0.0227162 -0.0775019 0.1024849 -0.1552728 0.0867128 0.119845 -0.0545888 -0.0199692 -0.0843605 -0.0165189 -0.0854852 0.1204883 -0.0235663 -0.0300823 -0.0137879 0.0658686 -0.017029 0.0129307 -0.0125577 -0.0130966 0.1016207 0.0125773 -0.0386228 0.0618205 -0.0069022 -0.0409674 -0.0136175 -0.0339817 0.0732063 0.1377144 0.0190036 -0.0132285 0.0563572 0.2892512 -0.0246683 0.0885992 0.029883 0.1635008 0.043681 0.0753807 -0.0289337 0.0986298 0.0394884 0.0558929 -0.0315077 0.0517471 0.101563 0.0980034 -0.047942 0.0346088 -0.0448803 0.0691532 0.0389843 0.0089705 0.0530313 0.1137539 0.1063529 -0.042031 0.027899 -0.0140633 0.0901567 0.0442276 0.0208972 0.0424113 0.1436623 0.0954273 0.0483446 -0.0275665 0.0241444 0.0995007 0.039471 -0.0039637 0.0367404 0.1482226 unknown
polarizability: 272.2560233|-7.8212064|148.505094|-7.2589251|8.7558756|137.3530857 unknown
InChI: InChI=1S/C10H7N3O4S2/c14-8-5-19-10(18)12(8)11-9(15)6-1-3-7(4-2-6)13(16)17/h1-4,11H,5H2
charge 0 multiplicity 1
26 atoms
S  -5.314842 -0.408855 -1.063857
S  -2.876675 -1.531214 -2.621272
O  -2.963215 2.035633 1.036883
O  -1.298089 -0.846106 1.310491
O  5.59349 0.91172 -0.675057
O  5.712556 -1.047046 0.489176
N  -2.826201 0.3614 -0.626112
N  -1.434097 0.39722 -0.662303
N  5.052474 -0.080141 -0.05175
C  -5.002389 0.84277 0.324655
C  -3.517613 1.179477 0.32257
C  0.776495 -0.172802 0.223579
C  -0.716442 -0.257345 0.362269
C  -3.542587 -0.537895 -1.446173
C  1.422031 0.905562 -0.436917
C  1.54773 -1.206266 0.815458
C  3.567207 -0.11115 0.048054
C  2.826772 0.942018 -0.528902
C  2.950903 -1.185378 0.727067
H  -5.280152 0.391645 1.290442
H  -5.599776 1.749952 0.149375
H  -1.017403 0.596068 -1.575964
H  0.838411 1.74091 -0.837545
H  1.028407 -2.011767 1.343364
H  3.35316 1.7630 -1.022109
H  3.56984 -1.971109 1.167379
