program: Gaussian 09
title: 000217642
version: EM64L-G09RevD.01
frameworkgroup: C1[X(C11H12N2O2)]
method: RPBEPBE
basis: SDD
operation: Freq
keyword: #p
keyword: freq=noraman
keyword: PBEPBE/SDD
title: #p freq=noraman PBEPBE/SDD
converged: YES YES NO NO
title: Mulliken charges:
elementType: O O N N C C C C C C C C C C C H H H H H H H H H H H H
charge: -0.292214 -0.267157 -0.097706 -0.338093 -0.473341 0.293664 0.274053 -0.644748 0.200347 -0.382935 -0.389257 -0.238845 -0.235102 0.288279 -0.758959 0.241858 0.291478 0.259849 0.258066 0.238566 0.239431 0.337020 0.232259 0.232307 0.254270 0.256400 0.220509
chargesum: 0.00000
title: Mulliken charges with hydrogens summed into heavy atoms:
elementType: O O N N C C C C C C C C C C C
charge: -0.292214 -0.267157 -0.097706 -0.001072 0.059996 0.293664 0.274053 -0.126833 0.200347 -0.144368 -0.149826 -0.006586 -0.002795 0.288279 -0.027781
polarizability: 1.83455726e+02 3.59699967e+00 1.43177547e+02 -1.12079647e+00 8.97889801e-01 7.87631476e+01
1716.lowfreq: -11.0899 -6.5318 -0.0005 0.0003 0.0005 1.2172 26.7012 39.0976 72.5289
frequency: 26.6515 38.9754 72.5284 92.5968 98.0470 137.3034 169.3798 228.3226 257.4653 291.8559 302.1163 346.6329 394.4240 430.8676 453.7167 486.9725 545.1802 553.1111 559.6225 588.7395 608.1529 620.2552 696.7639 724.6403 738.0474 755.4057 812.5980 860.5518 881.3667 924.3954 927.1553 963.0945 981.0385 988.5023 991.0446 1037.7584 1038.3433 1076.5025 1118.8874 1171.9033 1176.3242 1179.2194 1201.7786 1215.6381 1232.9713 1255.8246 1283.3039 1296.1108 1323.3594 1383.8962 1387.0142 1402.1752 1439.9474 1445.9913 1449.1703 1466.8759 1473.8895 1490.3480 1502.2014 1576.4493 1600.3309 1617.1516 1628.1072 2966.6276 2996.8364 2999.9905 3048.0557 3073.2211 3098.8476 3107.4185 3121.0553 3126.1339 3143.7240 3164.6761 3456.4007
redmass: 3.6107 4.4281 1.6366 2.6000 3.0424 4.5390 2.6643 2.8103 6.5016 3.8212 4.1485 3.8461 4.9094 3.6326 4.0249 2.9286 2.9516 2.3303 3.2259 2.9714 4.9511 4.7620 4.2344 4.2538 4.1112 1.2728 3.5960 1.8171 2.3927 2.1668 2.4659 1.7989 1.8226 1.5348 1.5330 2.2659 1.6273 3.3764 2.2488 1.1947 1.0810 2.4343 2.1336 1.6543 1.4268 1.3947 3.0500 3.9521 1.6055 6.8104 1.2356 2.2113 1.3087 1.7915 1.0477 1.0881 1.2636 2.2259 1.6756 9.1036 6.9719 6.5204 7.0494 1.0684 1.0604 1.0357 1.1010 1.0912 1.0987 1.1007 1.0867 1.0895 1.0935 1.1006 1.0774
irintensity: 0.4990 3.7460 6.4527 5.2177 2.9573 11.7337 1.1294 7.1157 3.6782 1.1731 2.0023 13.1859 1.2288 5.8026 33.6603 0.3505 9.0453 69.7445 17.9768 5.8964 1.3686 11.7765 6.9402 6.5318 1.7338 74.5402 6.8492 0.7729 0.4313 1.4598 11.2152 9.1207 6.3077 6.1192 2.8735 2.9665 14.8970 4.1929 3.9079 13.5108 1.8682 15.9913 23.5648 1.6693 28.7538 0.3995 18.2513 79.2596 19.5556 41.4543 53.4236 110.3801 4.8355 11.0438 12.4388 24.5594 112.5112 8.2039 25.2501 400.9200 4.7528 3.0352 75.6872 9.0464 10.7560 8.0601 8.1536 5.3476 9.3390 14.3349 7.5958 2.3549 24.1184 27.4626 60.6555
temp: 298.150 k
press: 1.00000 atm
elementType: 8 8 7 7 6 6 6 6 6 6 6 6 6 6 6 1 1 1 1 1 1 1 1 1 1 1 1
symmnumber: 1
zpe: 558189.4 jmol-1
zpe.correction: 0.212603 hartree
zpe.thermalcorrener: 0.226261 hartree
zpe.thermalcorrenthalpy: 0.227205 hartree
zpe.thermalcorrgfe: 0.170744 hartree
zpe.sumelectzpe: -685.236708 hartree
zpe.sumelectthermal: -685.223051 hartree
zpe.sumelectthermalent: -685.222107 hartree
zpe.sumelectthermalfe: -685.278567 hartree
dipole: 1.6088 -1.0648 -1.5641
dipole: 2.4836
quadrupole: -73.1465 -93.1565 -90.9673
quadrupole: 0.7053 7.5288 6.6448
quadrupole: 12.6103 -7.3998 -5.2105 0.7053 7.5288 6.6448
hfenergy: -685.4493116 hartree
pointgroup: C01 [X(C11H12N2O2)]
dipole: 0.6725669 -0.3720665 -0.6033343 debye
polarizability: 182.7070787|6.5402906|143.941083|0.5250133|0.7569577|78.7482585 unknown
InChI: InChI=1S/C11H12N2O2/c1-8(14)12-13-7-10-5-3-2-4-9(10)6-11(13)15/h2-5,12H,6-7H2,1H3
charge 0 multiplicity 1
27 atoms
O  -1.499696 2.419662 -0.44622
O  -2.900724 -1.707123 0.941687
N  -1.060116 0.170711 -0.120986
N  -2.349676 -0.08207 -0.647252
C  -0.172995 -0.993105 0.122387
C  1.296261 -0.62431 -0.006836
C  1.719787 0.716237 0.169702
C  0.694033 1.791206 0.492793
C  -0.696059 1.509602 -0.060163
C  2.250479 -1.63314 -0.28178
C  3.095517 1.031464 0.05784
C  3.622435 -1.315852 -0.377303
C  4.046526 0.023294 -0.209713
C  -3.237442 -0.963783 -0.026099
C  -4.62128 -0.992064 -0.66399
H  -0.442011 -1.767518 -0.618597
H  -0.403384 -1.419234 1.11677
H  0.595496 1.904148 1.593221
H  1.001707 2.776635 0.104955
H  1.918582 -2.668987 -0.423204
H  3.42127 2.071221 0.181702
H  -2.687923 0.711778 -1.207356
H  4.353367 -2.103274 -0.590283
H  5.108375 0.27931 -0.292045
H  -4.808705 -1.996789 -1.080916
H  -5.375037 -0.814883 0.121738
H  -4.752286 -0.246335 -1.466151
