program: Gaussian 09
title: 000217641
version: EM64L-G09RevD.01
frameworkgroup: C1[X(C16H14N2O2)]
method: RPBEPBE
basis: SDD
operation: Freq
keyword: #p
keyword: freq=noraman
keyword: PBEPBE/SDD
title: #p freq=noraman PBEPBE/SDD
converged: YES YES NO NO
title: Mulliken charges:
elementType: O O N N C C C C C C C C C C C C C C C C H H H H H H H H H H H H H H
charge: -0.293980 -0.281715 -0.095864 -0.371468 -0.467592 0.293364 0.271036 -0.645675 0.196290 -0.381443 -0.388769 -0.239350 -0.235448 0.201849 0.282953 -0.359791 -0.334154 -0.218960 -0.241948 -0.224616 0.245056 0.290198 0.259802 0.257935 0.239181 0.239297 0.342602 0.232286 0.232331 0.273776 0.222893 0.233130 0.233000 0.233794
chargesum: 0.00000
title: Mulliken charges with hydrogens summed into heavy atoms:
elementType: O O N N C C C C C C C C C C C C C C C C
charge: -0.293980 -0.281715 -0.095864 -0.028867 0.067662 0.293364 0.271036 -0.127938 0.196290 -0.142262 -0.149472 -0.007064 -0.003116 0.201849 0.282953 -0.086015 -0.111261 0.014170 -0.008947 0.009178
polarizability: 2.88099345e+02 5.60534229e+00 1.89424195e+02 1.97072356e+00 -6.45248825e+00 9.91560582e+01
1716.lowfreq: -14.1122 -8.1512 -3.5127 -0.0007 -0.0007 -0.0006 5.0323 14.3020 33.6072
frequency: -10.7782 13.4189 33.5532 44.1451 78.7311 104.1232 152.5310 164.5414 180.1217 221.5398 239.7243 289.9283 303.5716 334.9644 391.5662 398.8052 418.7617 430.1769 447.7866 480.7786 490.7217 539.9421 556.4829 569.2464 613.6015 614.1467 663.8533 674.5763 695.7787 698.8779 723.3822 731.9839 754.3156 787.8464 796.7079 851.2412 856.9514 875.3848 891.5199 925.5497 934.3081 962.8201 981.5398 984.2151 989.2463 990.1131 1005.8522 1016.5769 1037.1561 1041.0422 1085.0664 1109.1070 1124.8627 1171.6535 1173.9253 1176.1098 1190.7271 1197.6794 1205.8910 1216.8391 1244.8468 1255.7600 1284.8662 1299.7968 1323.4019 1323.8481 1384.0976 1384.9341 1402.2849 1434.1487 1440.8856 1446.5755 1468.9904 1480.1996 1493.5426 1513.8976 1560.7436 1584.8392 1600.8231 1610.6541 1611.3967 1617.9103 2966.1774 3001.2669 3052.3270 3073.5416 3120.4874 3121.3102 3126.2888 3133.2100 3143.8720 3146.8208 3159.7565 3164.7722 3170.7627 3472.0360
redmass: 3.9320 4.6619 4.8303 6.0741 4.7249 6.0474 4.4084 4.6423 3.4190 3.3181 4.5667 4.4949 5.9112 3.8448 4.4551 2.9573 6.2571 3.5992 4.2665 3.8357 3.2662 1.9678 3.1548 4.7145 5.9497 5.7745 6.1101 5.0340 3.9278 1.6362 4.3833 4.6676 1.2438 2.3750 3.5080 1.3028 2.2113 2.0111 4.5825 1.5963 1.4500 1.8180 1.8181 1.4254 4.9333 1.4091 1.3418 3.7430 2.3192 2.5101 1.6337 2.0982 2.9424 1.2015 1.0632 1.0688 2.2429 1.1634 1.7097 1.7371 1.8289 1.4068 3.1688 3.2782 1.5025 1.5287 7.0260 8.6250 2.2434 2.2138 1.3168 1.7897 1.4424 1.7327 2.1930 1.7677 8.8737 6.9476 7.0083 6.2970 6.4554 6.6528 1.0685 1.0605 1.1013 1.0911 1.0880 1.0867 1.0895 1.0870 1.0936 1.0918 1.0957 1.1006 1.1009 1.0764
irintensity: 0.0718 0.1651 1.3938 7.2338 5.6744 2.0497 1.1397 5.4225 1.5391 8.1266 12.5796 4.0994 5.5519 13.4937 1.0115 0.5515 2.5834 6.5607 24.5551 18.4777 9.3005 26.0596 36.7056 2.4694 0.3971 0.3671 17.5032 21.0803 11.2711 91.6574 8.0492 4.2842 71.6747 23.2042 2.0907 1.0728 2.9484 10.0769 20.2139 3.9507 5.7244 7.1467 2.9143 1.2349 0.2743 0.2285 1.0628 20.7257 3.6003 3.3582 16.9361 0.9734 6.0726 13.2188 2.4918 1.6921 7.1717 6.4909 32.5296 2.6329 53.9209 0.5105 40.1244 73.5184 12.9391 26.1660 36.2383 4.3957 135.3706 10.6870 4.7653 9.3549 146.0751 17.1004 9.2331 103.1917 326.7032 69.3125 4.5200 6.5898 22.1931 1.2482 9.1476 8.8265 7.3252 5.6082 9.4481 7.4055 2.2773 1.6682 23.7208 18.5943 14.9888 30.1550 23.5745 48.6223
temp: 298.150 k
press: 1.00000 atm
elementType: 8 8 7 7 6 6 6 6 6 6 6 6 6 6 6 6 6 6 6 6 1 1 1 1 1 1 1 1 1 1 1 1 1 1
symmnumber: 1
zpe: 695369.4 jmol-1
zpe.correction: 0.264852 hartree
zpe.thermalcorrener: 0.280682 hartree
zpe.thermalcorrenthalpy: 0.281626 hartree
zpe.thermalcorrgfe: 0.219436 hartree
zpe.sumelectzpe: -876.657075 hartree
zpe.sumelectthermal: -876.641245 hartree
zpe.sumelectthermalent: -876.640301 hartree
zpe.sumelectthermalfe: -876.702492 hartree
dipole: 0.8122 -0.8722 -1.6512
dipole: 2.0364
quadrupole: -85.0377 -117.5275 -121.1530
quadrupole: -1.2835 4.8514 2.6424
quadrupole: 22.8684 -9.6214 -13.2469 -1.2835 4.8514 2.6424
hfenergy: -876.9219271 hartree
pointgroup: C01 [X(C16H14N2O2)]
dipole: 0.338303 -0.2719285 -0.6734158 debye
polarizability: 287.7168044|6.8308847|189.997237|6.5412361|2.790139|98.9655558 unknown
InChI: InChI=1S/C16H14N2O2/c19-15-10-13-8-4-5-9-14(13)11-18(15)17-16(20)12-6-2-1-3-7-12/h1-9,17H,10-11H2
charge 0 multiplicity 1
34 atoms
O  0.327967 2.611408 0.275683
O  -1.369094 -1.626841 0.984873
N  0.546257 0.309025 0.184421
N  -0.804103 0.283073 -0.23216
C  1.324687 -0.952884 0.106276
C  2.806005 -0.695628 -0.118772
C  3.387248 0.545494 0.240162
C  2.51805 1.632251 0.852966
C  1.060585 1.578298 0.418601
C  3.615793 -1.718716 -0.668021
C  4.773259 0.750019 0.035564
C  4.999422 -1.514828 -0.856587
C  5.580567 -0.27359 -0.505498
C  -1.724816 -0.626551 0.286525
C  -3.158031 -0.378522 -0.105241
C  -4.056069 -1.469275 0.022698
C  -3.651656 0.880248 -0.542112
C  -5.419333 -1.314128 -0.301476
C  -5.01784 1.034407 -0.861912
C  -5.903714 -0.062342 -0.749164
H  0.904196 -1.543202 -0.727499
H  1.146687 -1.542711 1.024377
H  2.536871 1.555482 1.960723
H  2.891273 2.639641 0.603927
H  3.161577 -2.676481 -0.949873
H  5.219503 1.715539 0.302292
H  -1.089613 1.192976 -0.613534
H  5.617721 -2.312333 -1.282401
H  6.652021 -0.104209 -0.65758
H  -3.660395 -2.422915 0.386944
H  -3.000073 1.760178 -0.606549
H  -6.103562 -2.163811 -0.203048
H  -5.391735 2.010349 -1.189594
H  -6.963257 0.060777 -0.999214
