program: Gaussian 09
title: 000217638
version: EM64L-G09RevD.01
frameworkgroup: C1[X(C9H10N2O)]
method: RPBEPBE
basis: SDD
operation: Freq
keyword: #p
keyword: freq=noraman
keyword: PBEPBE/SDD
title: #p freq=noraman PBEPBE/SDD
converged: YES YES NO NO
title: Mulliken charges:
elementType: O N N C C C C C C C C C H H H H H H H H H H
charge: -0.284434 -0.150686 -0.515552 0.290949 0.309805 -0.478921 -0.629858 0.166117 -0.396892 -0.389879 -0.235869 -0.234468 0.242012 0.244884 0.252335 0.259299 0.235254 0.238894 0.230753 0.230954 0.300085 0.315218
chargesum: 0.00000
title: Mulliken charges with hydrogens summed into heavy atoms:
elementType: O N N C C C C C C C C C
charge: -0.284434 -0.150686 0.099751 0.290949 0.309805 0.007974 -0.118223 0.166117 -0.161637 -0.150985 -0.005116 -0.003514
polarizability: 1.42632547e+02 -1.72758346e+00 1.19687177e+02 -3.93778336e+00 1.51239910e-01 5.91131239e+01
1716.lowfreq: -7.4226 -4.3810 -2.3984 -0.0007 -0.0002 -0.0002 43.7015 94.5138 106.1243
frequency: 43.6633 94.5094 106.1235 170.4979 228.3348 235.6256 289.4543 342.1803 379.7187 393.6117 436.5040 487.3878 558.5314 572.2102 610.9465 685.3404 708.3915 729.9247 755.5330 780.4395 842.9330 861.4589 884.3484 926.4703 962.2981 985.2182 990.0873 1037.0308 1051.7932 1114.9202 1174.0727 1178.3318 1187.3800 1201.1245 1212.9789 1254.6064 1262.4045 1271.3554 1297.4470 1324.3232 1384.3605 1408.6683 1437.9091 1447.7773 1480.1748 1494.4865 1591.6342 1599.6097 1618.7074 1672.9730 2937.9521 2961.4602 3053.5784 3063.9282 3118.8983 3124.0042 3141.8557 3163.1470 3359.1675 3471.1939
redmass: 3.8735 1.6121 2.6010 2.6802 2.0542 3.1909 3.5050 4.5477 5.1026 7.3266 3.3282 2.8572 4.0295 5.0106 5.4757 4.9527 4.2899 4.1019 1.2733 3.0732 1.8520 1.6858 2.3322 1.6256 1.8011 1.7385 1.3746 2.2721 3.8748 2.0388 1.0866 1.1647 1.5545 1.6904 1.6550 1.5103 2.3150 1.9757 1.9448 1.5454 7.7610 2.1994 1.2779 1.9521 1.3277 2.0012 8.7642 7.0579 6.6469 1.0763 1.0705 1.0688 1.0908 1.0904 1.0866 1.0894 1.0934 1.1006 1.0431 1.0971
irintensity: 7.4547 34.5724 11.2398 2.1863 34.6744 4.3339 3.1920 28.4592 1.3720 3.0110 6.8631 0.6814 9.4897 1.5675 3.6968 9.3470 12.7476 9.9168 68.3934 33.5703 79.0051 7.3922 7.6370 4.3583 8.6065 1.7857 0.1495 5.5922 2.9248 4.2143 1.7545 5.4347 8.3350 12.1776 12.9088 0.3887 10.3534 38.1147 21.4066 1.0915 8.2713 33.7109 3.0982 10.0161 33.5497 6.4145 277.7333 19.5167 0.1631 26.1857 41.2612 11.8101 11.5207 4.8960 8.9446 2.5091 26.1471 27.5231 2.0749 5.4203
temp: 298.150 k
press: 1.00000 atm
elementType: 8 7 7 6 6 6 6 6 6 6 6 6 1 1 1 1 1 1 1 1 1 1
symmnumber: 1
zpe: 461525.3 jmol-1
zpe.correction: 0.175786 hartree
zpe.thermalcorrener: 0.186184 hartree
zpe.thermalcorrenthalpy: 0.187128 hartree
zpe.thermalcorrgfe: 0.139385 hartree
zpe.sumelectzpe: -532.802047 hartree
zpe.sumelectthermal: -532.791649 hartree
zpe.sumelectthermalent: -532.790705 hartree
zpe.sumelectthermalfe: -532.838448 hartree
dipole: 2.6150 -1.6406 0.2623
dipole: 3.0982
quadrupole: -71.8093 -68.2138 -70.4674
quadrupole: 6.6745 -0.5121 2.8062
quadrupole: -1.6458 1.9497 -0.3039 6.6745 -0.5121 2.8062
hfenergy: -532.9778328 hartree
pointgroup: C01 [X(C9H10N2O1)]
dipole: -1.0677517 0.5798246 0.0973797 debye
dipolederiv: -1.0875799 0.4615521 0.0973615 0.1769328 -0.7151506 -0.0220346 0.1460265 -0.1071961 -0.3996017 -0.18287 0.2443178 -0.0051847 0.2474705 -0.7936917 -0.0163742 -0.1910755 0.0841208 -0.2418178 -0.2505204 0.0015927 0.0232608 -0.0451026 -0.4353721 -0.102278 -0.0033739 -0.1309961 -0.0914051 0.0523434 0.1078568 0.0493331 0.2399165 -0.0171861 0.0219638 0.0866683 0.0430309 -0.0508466 0.2226881 -0.1217778 0.0478566 -0.2534862 -0.024541 -0.0227306 0.0742483 -0.0587467 -0.0276693 0.3703554 -0.1923775 -0.0766239 -0.1836885 0.2092147 0.0850687 -0.0844101 -0.0477723 0.3726938 -0.2128255 -0.0543663 0.0708946 -0.1162082 -0.0292139 0.0479686 0.0739042 0.1431583 0.1019116 1.0519267 -0.4191129 -0.1647985 -0.311223 1.2469061 -0.007005 -0.2009228 -0.0052005 0.186185 -0.0817235 -0.0386022 0.015122 -0.0507569 0.1025187 0.0087778 0.0193096 0.0108005 -0.1525542 -0.1604021 0.0311134 0.0160896 0.0195655 0.1163086 0.0052012 -0.0193605 0.0118764 -0.1534352 0.0231118 -0.0608099 0.0339161 -0.0748734 -0.0221203 -0.0131499 0.0236795 -0.0099323 -0.1550178 0.0403157 0.0573355 0.0387803 0.0727219 -0.0008056 0.0260744 0.0304358 0.020981 -0.1487837 0.0396364 0.0426222 0.0066293 0.0200723 -0.0584969 0.0523988 0.0180121 0.0948359 0.0406249 -0.0661806 0.0035561 -0.0393128 0.0338396 0.0314184 -0.039374 0.0192095 -0.1275122 -0.1337914 -0.0089115 0.0163892 -0.0299638 0.0186128 0.0736627 0.0254632 -0.0438763 0.0759839 -0.0624921 0.0225677 -0.0060875 -0.0056209 0.0098595 -0.0247923 -0.0635306 0.0132326 -0.1000865 0.0753065 0.0857691 -0.0262488 -0.0089512 0.0145167 -0.115389 -0.0069374 -0.0022701 -0.0042213 0.1484281 0.0843286 0.0393414 -0.0082139 -0.000003 -0.1094293 -0.0096229 -0.0043509 -0.008297 0.1481744 -0.0858956 0.0838491 -0.0350338 0.0900324 0.0412335 0.0111117 -0.0388362 0.010816 0.1559109 -0.0748171 -0.089626 -0.0399995 -0.0962836 0.0310524 -0.02174 -0.0414423 -0.0233455 0.1528032 0.108271 -0.0785625 0.0122963 0.0218612 0.3117915 -0.0571573 0.0395097 0.0465256 0.0080758 0.1104122 -0.0019549 0.0021626 0.1662236 0.1820823 0.0979064 0.0856824 0.0811773 0.2273005 unknown
polarizability: 142.6983971|-0.3017664|119.5603045|4.5300398|0.2730795|59.1741463 unknown
InChI: InChI=1S/C9H10N2O/c10-11-6-8-4-2-1-3-7(8)5-9(11)12/h1-4H,5-6,10H2
charge 0 multiplicity 1
22 atoms
O  3.029378 -1.12553 -0.213918
N  1.7598 0.807285 -0.007655
N  2.924066 1.62485 -0.197573
C  -0.712475 0.743651 0.21244
C  -0.658636 -0.67297 0.174327
C  0.560594 1.532359 0.466698
C  0.665938 -1.376722 0.412224
C  1.90857 -0.573022 0.025343
C  -1.947948 1.407799 0.02757
C  -1.847006 -1.405918 -0.060822
C  -3.132669 0.670696 -0.189442
C  -3.080621 -0.742145 -0.237694
H  0.531906 2.500332 -0.062021
H  0.674012 1.768073 1.547451
H  0.772967 -1.637454 1.48708
H  0.724008 -2.33292 -0.135643
H  -1.982896 2.504038 0.048722
H  -1.804646 -2.500994 -0.103874
H  -4.085334 1.192478 -0.331214
H  -3.993457 -1.320612 -0.417183
H  3.070597 1.78434 -1.207449
H  3.738352 1.118087 0.187532
