program: Gaussian 09
title: 000222589
version: EM64L-G09RevD.01
frameworkgroup: C1[X(C9H17NO)]
method: RPBEPBE
basis: SDD
operation: Freq
keyword: #p
keyword: freq=noraman
keyword: PBEPBE/SDD
title: #p freq=noraman PBEPBE/SDD
converged: YES YES NO NO
title: Mulliken charges:
elementType: O N C C C C C C C C C H H H H H H H H H H H H H H H H H
charge: -0.273202 -0.364593 0.307047 -0.546990 -0.712458 -0.709972 -0.722192 0.235518 -0.422175 -0.042284 -0.570986 0.197275 0.232212 0.213108 0.216674 0.204816 0.196430 0.268039 0.201294 0.233299 0.212594 0.198761 0.297149 0.260715 0.218173 0.235118 0.219799 0.216835
chargesum: 0.00000
title: Mulliken charges with hydrogens summed into heavy atoms:
elementType: O N C C C C C C C C C
charge: -0.273202 -0.067445 0.307047 -0.117503 -0.077861 -0.044210 -0.077538 0.235518 0.056712 0.192834 -0.134353
polarizability: 1.46340002e+02 -1.19525558e+01 9.64154027e+01 5.03573345e+00 -1.92644937e+00 8.75243731e+01
1716.lowfreq: -2.8990 -0.0006 0.0001 0.0004 2.8464 13.5207 25.3058 49.8230 57.6621
frequency: 23.8760 49.7375 57.5965 89.0629 122.2074 171.4475 191.9587 244.9065 253.4934 260.5146 277.6143 295.7361 337.9296 363.5509 388.3746 404.7688 433.2393 468.5431 573.9981 608.9582 653.4664 705.0136 765.5197 861.9767 887.8545 908.4978 924.2643 931.1775 932.9890 950.7293 951.5708 994.8706 1013.1393 1027.4688 1032.8755 1072.9369 1130.9840 1143.9043 1201.7036 1232.6984 1238.8546 1248.5242 1279.4346 1285.1887 1314.1544 1335.9220 1374.8017 1380.2133 1403.2097 1427.4202 1449.6336 1456.9605 1463.2773 1464.0310 1468.7386 1476.8384 1480.4797 1485.3624 1496.0881 1606.7182 1656.2859 2963.2846 2967.6191 2972.3142 2977.4573 2980.7341 3040.7993 3042.9984 3056.5469 3062.3078 3062.4732 3067.9639 3073.0956 3087.7016 3095.3753 3105.1523 3199.5223 3553.6590
redmass: 3.3086 3.1769 4.3439 2.3515 2.6842 3.2488 1.0455 1.1690 1.4805 1.9015 2.4695 2.6558 2.5615 2.2504 2.4480 1.9728 2.3693 1.9297 1.7993 1.5064 1.8605 4.2079 4.1423 2.3117 2.2134 1.6958 1.9007 1.5514 1.7177 1.2574 1.3096 1.4829 1.5412 1.4929 1.5513 2.8726 1.4194 2.0062 1.9376 1.5347 2.7279 1.7486 1.2649 1.8536 1.5205 1.3620 1.1973 1.2017 1.2078 1.2002 1.1433 1.0507 1.1557 1.0929 1.0545 1.2931 1.2017 1.0846 1.0625 5.9236 4.5993 1.0353 1.0365 1.0461 1.0496 1.0596 1.1010 1.1004 1.0998 1.0992 1.0989 1.0989 1.0988 1.0604 1.0987 1.0943 1.1142 1.0778
irintensity: 0.7741 0.1136 5.7963 0.8013 2.1731 2.8952 0.0608 0.3251 3.3313 4.7515 0.6662 4.4903 3.5518 1.9111 0.0832 1.0890 1.9336 8.2741 61.2220 50.3370 15.2334 0.3226 2.1265 4.4939 0.3778 9.8391 3.0267 2.1346 2.6328 22.7700 58.8291 9.7094 23.4236 1.2502 5.0607 2.3232 20.0297 14.6752 22.7911 0.1259 77.6411 64.4070 3.0007 2.4956 26.6207 17.1363 20.3830 33.8028 18.0224 20.5192 15.8992 3.6747 52.2796 15.3144 1.8518 73.1026 69.2806 35.8960 33.3327 155.2460 18.2922 34.1793 34.4487 53.9300 16.7246 47.7535 9.7158 6.1444 2.6391 36.2139 45.0708 60.3059 68.6174 13.7797 16.6599 9.3844 24.6211 15.3824
temp: 298.150 k
press: 1.00000 atm
elementType: 8 7 6 6 6 6 6 6 6 6 6 1 1 1 1 1 1 1 1 1 1 1 1 1 1 1 1 1
symmnumber: 1
zpe: 640255.1 jmol-1
zpe.correction: 0.243860 hartree
zpe.thermalcorrener: 0.257528 hartree
zpe.thermalcorrenthalpy: 0.258473 hartree
zpe.thermalcorrgfe: 0.202967 hartree
zpe.sumelectzpe: -482.233859 hartree
zpe.sumelectthermal: -482.220191 hartree
zpe.sumelectthermalent: -482.219247 hartree
zpe.sumelectthermalfe: -482.274753 hartree
dipole: 0.6557 -2.8754 2.1146
dipole: 3.6289
quadrupole: -63.4686 -75.2069 -67.8423
quadrupole: -0.6587 1.5054 3.1343
quadrupole: 5.3706 -6.3676 0.9970 -0.6587 1.5054 3.1343
hfenergy: -482.4777196 hartree
pointgroup: C01 [X(C9H17N1O1)]
dipole: 0.1450191 0.8198875 -1.1598209 debye
polarizability: 144.0724449|11.1688026|95.1169466|-12.406506|-5.330118|91.0903864 unknown
InChI: InChI=1S/C9H17NO/c1-5-6-10-8(11)7-9(2,3)4/h5,10H,1,6-7H2,2-4H3
charge 0 multiplicity 1
28 atoms
O  0.169873 -1.50727 1.072792
N  1.166599 -0.327832 -0.663836
C  -2.248727 0.357489 0.10453
C  -1.286771 -0.590454 -0.696353
C  -3.465102 0.669016 -0.808578
C  -2.742533 -0.339487 1.399295
C  -1.521882 1.680114 0.463441
C  0.057045 -0.85584 -0.013693
C  2.538526 -0.4725 -0.141193
C  3.217057 0.870074 0.039054
C  4.400579 1.213118 -0.528567
H  -1.126385 -0.161169 -1.705905
H  -1.792255 -1.566329 -0.827771
H  -3.976483 -0.260632 -1.122566
H  -4.201928 1.294039 -0.27022
H  -3.156659 1.215872 -1.720444
H  -3.395034 0.343435 1.975842
H  -1.894111 -0.647506 2.032903
H  -3.326458 -1.248301 1.158999
H  -0.679271 1.498878 1.155589
H  -2.220911 2.3788 0.959502
H  -1.125653 2.182891 -0.440252
H  1.034273 0.203269 -1.526033
H  2.427992 -0.996286 0.827989
H  3.141116 -1.118843 -0.808967
H  2.687798 1.584387 0.686846
H  4.861806 2.19078 -0.351338
H  4.9473 0.518685 -1.179467
