program: Gaussian 09
title: 000222651
version: EM64L-G09RevD.01
frameworkgroup: C1[X(C17H15Cl3O4)]
method: RPBEPBE
basis: SDD
operation: Freq
keyword: #p
keyword: freq=noraman
keyword: PBEPBE/SDD
title: #p freq=noraman PBEPBE/SDD
converged: YES YES NO NO
title: Mulliken charges:
elementType: Cl Cl Cl O O O O C C C C C C C C C C C C C C C C C H H H H H H H H H H H H H H H
charge: -0.067616 -0.014250 -0.049666 -0.252882 -0.247611 -0.275597 -0.199958 0.341874 0.259527 -0.323970 -0.320138 -0.426919 -0.364131 -0.328291 0.464722 -0.783119 -0.106617 -0.241101 0.248891 -0.286680 -0.299829 -0.196327 -0.232696 -0.108072 0.237209 0.260738 0.269407 0.258170 0.272032 0.245825 0.262221 0.233078 0.218492 0.247338 0.239788 0.254300 0.273224 0.282732 0.255902
chargesum: 0.00000
title: Mulliken charges with hydrogens summed into heavy atoms:
elementType: Cl Cl Cl O O O O C C C C C C C C C C C C C C C C C
charge: -0.067616 -0.014250 -0.049666 -0.252882 -0.247611 -0.275597 -0.199958 0.341874 0.259527 0.173977 0.207439 0.090938 -0.101911 -0.095213 0.464722 -0.077501 -0.106617 0.013199 0.248891 -0.286680 -0.026606 0.086406 0.023206 -0.108072
polarizability: 3.22095242e+02 2.45491305e+01 2.16264060e+02 -7.13212269e+00 5.86747576e+00 1.49678333e+02
1716.lowfreq: -7.4893 -3.2090 -0.0025 -0.0015 0.0012 2.7818 7.3271 8.4210 16.1543
frequency: 3.9615 8.1163 16.1295 23.8310 35.0172 49.4393 60.5655 83.7415 104.6800 111.1152 132.3207 147.7558 165.3074 180.2887 191.6647 196.0488 204.6172 222.7310 246.3991 262.6030 300.4708 330.9893 339.5610 356.7926 364.4218 379.0933 382.8247 414.2221 439.0907 442.9575 448.9359 493.9336 543.4150 546.1735 548.1238 548.4993 572.6368 614.9662 619.4257 649.5611 674.4511 702.0019 711.5949 728.9086 776.6644 794.7136 807.7361 822.0770 837.2830 856.7473 864.2638 878.3628 920.6442 927.5712 933.9865 995.3569 1000.5122 1008.4906 1024.4738 1026.3834 1036.7469 1048.0975 1063.3927 1087.4016 1090.6039 1101.1920 1132.7449 1154.1888 1181.6352 1222.7654 1223.3754 1234.5724 1247.1503 1258.3056 1265.8129 1269.6565 1338.1306 1346.2514 1360.6044 1372.4592 1379.5276 1387.6228 1393.8891 1402.9321 1436.9713 1448.3192 1455.7781 1459.1972 1465.0816 1470.1723 1480.5491 1571.2193 1590.9682 1593.8400 1603.6650 1669.2503 2987.4007 2994.7143 3003.5569 3045.6091 3066.9605 3078.0948 3097.7257 3109.8694 3131.0326 3151.8761 3159.5784 3160.2338 3176.2542 3178.9806 3182.5018
redmass: 7.2727 8.4519 12.1302 6.6779 5.5605 5.5033 9.9001 8.5445 7.4863 6.4006 1.0647 8.2214 5.9280 10.0340 3.6899 3.7534 4.5328 3.8249 4.2091 4.3211 5.9245 7.3296 6.7623 9.1819 7.0053 4.5630 9.4264 3.0365 3.0025 3.3435 3.4699 4.2119 3.5725 4.0649 4.1217 3.4508 4.2837 6.8035 7.4270 5.6402 6.4634 4.0860 3.3946 5.0212 5.3879 1.4646 1.4639 5.6238 3.3407 5.8080 1.3849 1.3424 1.3608 5.2375 1.3456 1.5957 2.6773 2.5241 3.8406 4.0666 4.6027 1.5193 2.5005 2.4000 1.9978 4.1596 2.0499 1.3261 2.0212 1.6899 2.3213 1.1881 1.8823 1.2208 1.2967 1.2866 1.2655 1.3570 3.1578 1.4273 6.6983 4.9998 3.0463 1.2868 1.0821 1.0835 1.0949 1.0452 2.5333 1.6439 1.5947 7.5478 6.7249 7.5113 7.4797 9.8376 1.0366 1.0635 1.0665 1.0601 1.0970 1.0971 1.1003 1.0989 1.1065 1.0882 1.0885 1.0925 1.0967 1.0960 1.0940
irintensity: 1.0597 0.5918 0.0410 0.1372 0.4250 0.5990 0.7777 1.6028 0.2730 1.3669 0.7853 0.7475 0.1526 1.5385 5.0858 5.9017 2.9917 3.0277 2.0112 6.6256 25.5186 0.7668 2.8767 5.3681 3.3561 0.4386 4.3257 12.0774 5.0118 3.4311 1.7987 7.4715 4.4662 2.7322 5.5748 5.3093 7.0605 42.2386 36.5980 16.6416 17.3831 2.2341 0.8666 4.5754 51.3164 49.7458 44.3759 13.0205 2.0868 36.3993 21.0472 17.0548 2.2034 87.5511 0.6422 4.1950 28.2136 2.4736 65.0613 157.2075 19.6770 7.2530 93.5196 19.3712 19.8219 576.1776 33.6830 3.5063 62.8869 34.0409 86.6854 11.9839 68.8210 2.7927 98.2570 3.0973 8.6846 7.7607 28.3068 0.5312 4.9480 2.8762 14.3940 17.3698 24.6466 30.4247 20.6125 14.3450 242.9070 27.2128 155.1547 29.3310 2.2518 6.6078 8.2086 167.6759 22.8334 31.2809 30.6865 11.6570 13.8825 9.8425 21.2083 7.7039 9.0457 16.8409 2.5246 2.5818 4.3350 1.5663 0.2852
temp: 298.150 k
press: 1.00000 atm
elementType: 17 17 17 8 8 8 8 6 6 6 6 6 6 6 6 6 6 6 6 6 6 6 6 6 1 1 1 1 1 1 1 1 1 1 1 1 1 1 1
symmnumber: 1
zpe: 738353.8 jmol-1
zpe.correction: 0.281224 hartree
zpe.thermalcorrener: 0.305176 hartree
zpe.thermalcorrenthalpy: 0.306120 hartree
zpe.thermalcorrgfe: 0.220296 hartree
zpe.sumelectzpe: -2336.103768 hartree
zpe.sumelectthermal: -2336.079816 hartree
zpe.sumelectthermalent: -2336.078872 hartree
zpe.sumelectthermalfe: -2336.164696 hartree
dipole: 0.0296 1.1995 -0.6595
dipole: 1.3691
quadrupole: -203.1520 -162.4281 -158.1503
quadrupole: -6.6250 -3.8454 5.6658
quadrupole: -28.5752 12.1487 16.4265 -6.6250 -3.8454 5.6658
hfenergy: -2336.384992 hartree
pointgroup: C01 [X(C17H15Cl3O4)]
dipole: -0.0172521 -0.2790766 0.4604014 debye
polarizability: 322.2068552|3.5197821|148.9819762|-24.5726889|3.626174|216.8488039 unknown
InChI: InChI=1S/C17H15Cl3O4/c1-11-8-12(18)2-4-15(11)24-10-17(21)23-7-6-22-16-5-3-13(19)9-14(16)20/h2-5,8-9H,6-7,10H2,1H3
charge 0 multiplicity 1
39 atoms
Cl 7.731576 -1.014015 -0.98358
Cl -6.493122 0.829665 -2.570746
Cl -6.94804 -0.488503 2.804028
O  2.386572 0.727839 1.195549
O  -3.58901 0.83239 -2.035154
O  -0.626061 -0.427171 -0.577942
O  1.041557 1.03423 -1.324608
C  4.737489 1.050049 0.954393
C  3.59687 0.261779 0.626509
C  -2.135332 1.052419 -1.963083
C  -1.326941 -0.262986 -1.889542
C  1.167092 -0.006748 0.939162
C  5.991598 0.639526 0.449873
C  3.703502 -0.890815 -0.182373
C  -4.29198 0.512468 -0.869993
C  4.591789 2.289153 1.811332
C  6.092121 -0.516097 -0.350768
C  4.966876 -1.288683 -0.678176
C  0.57683 0.286547 -0.445354
C  -5.708764 0.474547 -0.977244
C  -3.700706 0.22853 0.386531
C  -6.522386 0.172609 0.128076
C  -4.504612 -0.075834 1.508267
C  -5.902246 -0.097208 1.364959
H  -1.882011 1.71688 -1.114409
H  -1.916713 1.584378 -2.901167
H  -1.992222 -1.136989 -1.95466
H  -0.567338 -0.297856 -2.687753
H  0.449958 0.337011 1.703931
H  1.292852 -1.100285 1.063525
H  6.885915 1.225009 0.683953
H  2.827243 -1.486082 -0.455118
H  5.568435 2.773103 1.978471
H  3.913425 3.019504 1.333817
H  4.146223 2.044709 2.792698
H  5.061206 -2.177257 -1.308304
H  -2.612774 0.211298 0.493988
H  -7.609947 0.153553 0.023836
H  -4.042125 -0.29727 2.47388
