program: Gaussian 09
title: 000222584
version: EM64L-G09RevD.01
frameworkgroup: C1[X(C7H10N2OS)]
method: RPBEPBE
basis: SDD
operation: Freq
keyword: #p
keyword: freq=noraman
keyword: PBEPBE/SDD
title: #p freq=noraman PBEPBE/SDD
converged: NO NO NO NO
title: Mulliken charges:
elementType: S O N N C C C C C C C H H H H H H H H H H
charge: 0.176615 -0.228058 -0.360556 0.055959 0.407190 -0.245911 -0.544468 -0.434539 -0.786483 0.032503 -0.663422 0.326612 0.289637 0.289815 0.252893 0.242618 0.242769 0.258081 0.228470 0.228451 0.231824
chargesum: 0.00000
title: Mulliken charges with hydrogens summed into heavy atoms:
elementType: S O N N C C C C C C C
charge: 0.176615 -0.228058 -0.033944 0.055959 0.407190 -0.245911 0.034984 -0.181646 -0.043016 0.032503 0.025324
polarizability: 1.54294571e+02 3.77143783e+00 1.29620791e+02 9.56064367e-03 1.43325002e-02 5.75556763e+01
1716.lowfreq: -16.8408 -4.5219 -0.0018 -0.0012 -0.0010 4.8176 19.9187 41.6496 99.3902
frequency: 18.3569 41.0648 99.3897 104.2210 128.7959 147.4014 203.5336 229.0856 236.4063 265.1957 328.4528 413.7991 482.5904 530.3861 541.7630 572.4017 593.7487 622.1066 623.4216 737.2264 770.0373 837.9370 867.8272 869.2501 965.2562 993.5553 1031.0838 1047.6066 1051.9633 1067.9647 1106.3334 1179.2331 1215.2816 1228.9944 1278.5104 1345.5844 1397.0108 1403.3448 1421.2950 1446.9778 1465.6247 1470.2545 1470.4930 1481.6365 1540.7181 1603.2424 1650.9758 2979.9055 2989.2235 3056.5879 3056.6332 3085.5942 3086.9023 3117.3697 3136.5123 3185.6633 3528.1564
redmass: 1.9845 3.6586 4.0371 1.4997 2.1815 6.1857 3.7791 1.0999 3.8818 4.1735 4.2495 8.2905 6.8087 5.3300 4.0630 7.9666 1.2009 7.2525 4.7435 3.8714 1.1160 7.5988 6.6441 1.4639 2.2537 1.8440 2.1857 1.2204 1.5257 2.2136 4.0130 4.4456 1.6719 1.2245 1.2587 1.8749 1.2065 1.2858 3.1093 1.0872 1.0433 1.1898 1.0395 1.0489 3.6239 10.0617 6.0557 1.0390 1.0354 1.0604 1.0981 1.0968 1.1013 1.0970 1.1084 1.0934 1.0784
irintensity: 0.2276 7.9173 5.8081 0.2040 0.4252 0.0280 0.5453 0.1365 0.5955 1.7528 1.3127 17.4035 0.4100 10.8943 10.4690 0.8581 89.9463 0.6787 5.1220 0.0221 10.2113 3.7635 36.3009 32.1534 0.8157 26.7237 6.0341 0.0500 9.5979 1.2842 5.4576 163.6735 112.4330 0.7205 18.7623 12.3368 19.1989 31.6181 165.8753 7.3865 18.1759 28.8738 16.2235 8.3219 570.5783 62.0846 299.7507 21.0188 28.8829 1.5932 14.4844 20.2620 18.5186 9.7838 15.4588 3.6209 45.0547
temp: 298.150 k
press: 1.00000 atm
elementType: 16 8 7 7 6 6 6 6 6 6 6 1 1 1 1 1 1 1 1 1 1
symmnumber: 1
zpe: 426767.1 jmol-1
zpe.correction: 0.162547 hartree
zpe.thermalcorrener: 0.174654 hartree
zpe.thermalcorrenthalpy: 0.175598 hartree
zpe.thermalcorrgfe: 0.122346 hartree
zpe.sumelectzpe: -854.704428 hartree
zpe.sumelectthermal: -854.692321 hartree
zpe.sumelectthermalent: -854.691377 hartree
zpe.sumelectthermalfe: -854.744629 hartree
dipole: 0.2163 -6.6212 0.0084
dipole: 6.6248
quadrupole: -56.3194 -83.2012 -74.0380
quadrupole: -13.8110 -0.0014 0.0069
quadrupole: 14.8668 -12.0150 -2.8518 -13.8110 -0.0014 0.0069
hfenergy: -854.866975 hartree
pointgroup: C01 [X(C7H10N2O1S1)]
dipole: -0.0092005 -2.5781358 0.382554 debye
dipolederiv: -0.9494807 -0.0542467 -0.0036871 -0.1878153 -0.2222245 0.0117157 0.0153889 0.0135187 -0.1261435 -0.5590706 -0.1252257 0.015785 -0.3123526 -1.2676779 0.1267511 0.0434038 0.1296936 -0.3947027 -1.3719109 -0.0844515 -0.0048515 0.2035109 -0.6437733 0.0677513 -0.0471619 0.0629664 -0.2133019 -1.0942801 -0.5144509 0.062899 -0.8455068 -1.0683969 0.1139229 0.1111715 0.1183931 -0.2277698 0.8000558 0.2512542 -0.0249489 0.1073691 0.718698 -0.1019915 -0.0035267 -0.1000663 0.0297392 1.6883603 0.1411641 0.0032614 0.5512058 1.0191389 -0.1375381 -0.0569041 -0.1430356 0.0541751 0.4457801 -0.1980006 0.0330794 -0.3870942 0.1860076 -0.0137404 0.0610609 -0.0111185 0.1294298 -0.2831298 0.3188036 -0.0479746 0.0846272 -0.7032985 0.0760078 -0.0137609 0.0795433 -0.2087796 -0.1045205 0.0416281 -0.0088409 0.1302446 -0.067159 0.0234011 -0.0223635 0.0225665 0.0734371 1.2233708 0.222974 -0.0183782 0.4874503 1.6782459 -0.2044319 -0.057058 -0.2083183 0.273079 -0.125407 -0.0049282 -0.0021207 0.1834083 0.0320406 0.0089286 -0.0294978 0.0063782 0.0753197 0.2115475 -0.0293679 0.0025624 -0.0206556 0.1884725 0.0194064 0.0014938 0.0194174 0.3191188 -0.0006714 -0.006281 -0.0419222 0.0603001 -0.0289072 -0.0650064 -0.062669 -0.0473058 0.0055945 -0.0029126 0.0046571 0.0423626 0.0737738 0.0049333 0.0674051 0.0433218 0.0478472 -0.0252607 -0.0814094 -0.0076666 -0.0026817 -0.0037458 0.1009067 0.0096551 -0.0032308 0.0096224 0.1658076 0.0805571 -0.0094147 -0.051177 0.0348471 -0.0365288 -0.0916877 -0.0104382 -0.1233035 0.0037366 0.0788143 0.0030156 0.0550323 0.0343476 0.0266561 0.0858227 0.0033207 0.1162468 -0.0577521 -0.0624624 -0.0197005 0.0003189 -0.1220088 0.0594196 0.0081512 0.0154018 0.0095171 0.1247262 0.0868667 -0.0136866 -0.0186065 -0.1041106 0.0059396 -0.1220197 -0.0514011 -0.1075868 -0.0322754 0.0842556 -0.009844 0.026148 -0.0874858 0.0652733 0.0906201 0.0834694 0.0785295 -0.0891855 -0.0643529 0.0937682 -0.0162597 0.1196907 -0.0477661 0.0268766 -0.0200207 0.0264948 0.1210079 unknown
polarizability: 154.5150607|3.0406988|127.874656|0.9534825|-10.2889245|59.0813218 unknown
InChI: InChI=1S/C7H10N2OS/c1-3-11-7-8-5(2)4-6(10)9-7/h4,8H,3H2,1-2H3
charge 0 multiplicity 1
21 atoms
S  -2.090465 -1.256254 -0.130806
O  1.317896 2.527373 -0.637476
N  0.618862 -1.455444 -0.061689
N  -0.222761 0.759684 -0.400054
C  1.955895 -1.031388 -0.103487
C  -0.412242 -0.522817 -0.214113
C  -3.117999 0.324025 -0.374418
C  2.210219 0.309371 -0.296509
C  3.004536 -2.102582 0.070496
C  1.121069 1.292583 -0.457916
C  -4.608469 -0.038645 -0.34209
H  0.39739 -2.443652 0.080677
H  -2.826172 1.015579 0.430142
H  -2.801797 0.759205 -1.334292
H  3.238386 0.676717 -0.334499
H  2.927186 -2.872899 -0.720392
H  2.902061 -2.609847 1.048768
H  4.011241 -1.661381 0.019079
H  -4.876313 -0.743893 -1.14868
H  -4.900777 -0.485366 0.624728
H  -5.203547 0.881731 -0.484471
