program: Gaussian 09
title: 000217622
version: EM64L-G09RevD.01
frameworkgroup: C1[X(C10H15N3O3)]
method: RPBEPBE
basis: SDD
operation: Freq
keyword: #p
keyword: freq=noraman
keyword: PBEPBE/SDD
title: #p freq=noraman PBEPBE/SDD
converged: YES YES NO NO
title: Mulliken charges:
elementType: O O O N N N C C C C C C C C C C H H H H H H H H H H H H H H H
charge: -0.243286 -0.314027 -0.325854 -0.178651 -0.208901 0.046449 -0.374290 -0.375529 -0.311263 -0.313701 0.333362 0.108009 -0.452568 0.195059 -0.598500 -0.514934 0.214429 0.280800 0.224135 0.222178 0.200373 0.219062 0.222387 0.194033 0.264816 0.243827 0.241397 0.272043 0.290574 0.215342 0.223228
chargesum: 0.00000
title: Mulliken charges with hydrogens summed into heavy atoms:
elementType: O O O N N N C C C C C C C C C C
charge: -0.243286 -0.314027 -0.325854 -0.178651 -0.208901 0.046449 0.120938 0.070785 0.108172 0.102719 0.333362 0.108009 -0.187751 0.195059 0.158766 0.214210
polarizability: 2.00321138e+02 4.01536710e+00 1.56154634e+02 4.16628401e-01 -7.82329403e-01 8.85895736e+01
1716.lowfreq: -4.1756 0.0003 0.0007 0.0009 5.8153 11.7465 40.8404 50.5642 62.9851
frequency: 40.7744 50.5063 62.9776 81.6109 94.3003 103.3780 147.9485 169.2391 228.2342 239.6298 248.3707 273.9020 276.8782 313.3134 347.3970 371.8965 383.0487 403.4741 456.4346 481.9569 485.9482 558.9165 563.2801 608.9127 637.3732 644.4926 715.3514 727.0685 802.8740 832.1820 846.6973 861.5191 887.8827 914.8490 963.1760 997.9259 1021.8502 1035.2553 1052.7525 1079.9547 1101.0149 1111.1500 1123.9884 1135.5427 1152.6483 1180.1149 1200.3765 1218.6975 1246.7578 1252.8379 1269.9741 1278.6950 1291.0431 1337.0640 1345.3874 1351.8247 1370.1536 1378.4630 1397.6858 1415.8449 1425.1965 1444.8028 1449.2650 1451.3812 1452.7468 1458.7167 1466.9415 1482.4752 1486.1102 1493.2801 1558.7496 1588.6202 2925.7057 2936.4559 2954.0771 2964.2226 2987.4746 3008.6221 3056.7069 3080.5475 3089.2691 3098.9012 3100.0299 3102.5212 3139.4301 3142.1724 3177.5210
redmass: 2.9151 1.2054 3.0807 5.5045 2.3554 3.0769 1.5386 3.7253 3.5587 2.4707 3.0176 4.2282 4.5805 4.0371 3.3224 5.1071 3.1849 2.9279 2.8225 6.2376 6.7129 7.9695 3.1489 3.8930 5.4632 4.0736 5.4581 7.5385 4.2306 1.4326 1.5226 5.7297 5.8426 2.5644 3.8647 2.9523 2.3256 2.7471 1.9478 4.4127 2.1851 1.2368 1.3154 4.2031 1.4479 2.8064 1.1250 2.9536 1.4393 2.7150 2.4186 1.9186 1.5062 1.3334 1.2495 1.4208 1.3410 1.3474 1.9543 1.2929 1.5392 1.0831 1.0852 1.0979 1.1362 1.1329 1.0736 1.1011 1.0723 3.6476 7.5585 7.6908 1.0682 1.0705 1.0662 1.0666 1.0322 1.0341 1.0933 1.0968 1.0980 1.0955 1.0967 1.1012 1.1061 1.1014 1.0907
irintensity: 0.8216 0.1241 0.3303 4.9212 7.3793 4.3188 2.3494 3.6557 3.7817 2.9722 7.3873 0.3833 1.1058 21.8645 10.5208 11.1321 1.9000 4.9502 0.3465 0.7982 8.1485 3.0181 28.3059 4.5577 6.2310 7.0867 8.8712 3.7479 13.6885 12.8193 9.1416 9.0729 23.8004 9.0683 47.4465 50.8208 27.7803 46.4243 22.6378 45.1234 19.0229 12.5019 2.9135 18.9826 3.2466 49.6103 15.2315 57.8749 57.6923 71.2952 19.7809 23.4485 59.0443 2.2138 3.9447 15.6035 8.1534 13.8755 145.2286 29.9277 16.3783 1.7624 14.2199 15.9806 23.8443 12.6075 29.5504 11.4802 44.2281 21.1773 149.1807 465.1939 60.1194 67.3407 52.2715 85.0763 80.6435 43.6617 25.4592 39.2018 35.0199 25.3289 13.8400 20.7822 5.0648 0.4649 5.5325
temp: 298.150 k
press: 1.00000 atm
elementType: 8 8 8 7 7 7 6 6 6 6 6 6 6 6 6 6 1 1 1 1 1 1 1 1 1 1 1 1 1 1 1
symmnumber: 1
zpe: 656120.2 jmol-1
zpe.correction: 0.249903 hartree
zpe.thermalcorrener: 0.265558 hartree
zpe.thermalcorrenthalpy: 0.266502 hartree
zpe.thermalcorrgfe: 0.206361 hartree
zpe.sumelectzpe: -778.697995 hartree
zpe.sumelectthermal: -778.682340 hartree
zpe.sumelectthermalent: -778.681396 hartree
zpe.sumelectthermalfe: -778.741538 hartree
dipole: -1.4589 -0.8896 1.3533
dipole: 2.1797
quadrupole: -106.0529 -89.6206 -92.5330
quadrupole: -3.7171 0.2206 1.1999
quadrupole: -9.9841 6.4482 3.5358 -3.7171 0.2206 1.1999
hfenergy: -778.9478984 hartree
pointgroup: C01 [X(C10H15N3O3)]
dipole: 0.5586805 0.3421989 0.553353 debye
polarizability: 199.3925176|7.5297502|156.3085295|-2.4106235|6.8568038|89.3642992 unknown
InChI: InChI=1S/C10H15N3O3/c1-12-10(14)9(15-2)8(7-11-12)13-3-5-16-6-4-13/h7H,3-6H2,1-2H3
charge 0 multiplicity 1
31 atoms
O  4.337637 0.449508 -0.102381
O  -0.124168 -1.896268 -0.146905
O  -3.021842 -1.565225 -0.19521
N  1.441378 0.475283 0.012583
N  -2.744121 0.739042 0.189866
N  -1.99824 1.884652 0.303715
C  2.162521 -0.363273 -0.98503
C  2.224592 1.661458 0.429609
C  3.551557 -0.747277 -0.455783
C  3.617319 1.216982 0.920909
C  0.039605 0.50148 0.060273
C  -0.763627 -0.661499 -0.01133
C  -0.668206 1.754128 0.224748
C  -2.223203 -0.578972 -0.029767
C  -4.204958 0.939075 0.228373
C  -0.688588 -3.079431 0.553776
H  2.279758 0.215987 -1.92801
H  1.574631 -1.269512 -1.189864
H  1.713519 2.175473 1.26269
H  2.34371 2.381239 -0.411569
H  3.447943 -1.403068 0.435059
H  4.137422 -1.264358 -1.232937
H  4.248965 2.094616 1.136838
H  3.503506 0.604106 1.841519
H  -0.129584 2.701834 0.285819
H  -4.534944 1.496099 -0.665144
H  -4.470018 1.512422 1.130756
H  -4.679115 -0.052617 0.24086
H  -1.719587 -3.265589 0.218127
H  -0.665608 -2.909774 1.646255
H  -0.012156 -3.903922 0.282558
