program: Gaussian 09
title: 000222588
version: EM64L-G09RevD.01
frameworkgroup: C1[X(C9H16O5)]
method: RPBEPBE
basis: SDD
operation: Freq
keyword: #pfreq=noraman
keyword: PBEPBE/SDD
title: #p freq=noraman PBEPBE/SDD
converged: YES YES NO NO
title: Mulliken charges:
elementType: O O O O O C C C C C C C C C H H H H H H H H H H H H H H H H
charge: -0.222601 -0.505169 -0.443005 -0.444106 -0.441173 -0.075462 -0.187760 -0.215811 -0.247362 0.088318 -0.390837 -0.434521 -0.384985 -0.370093 0.247144 0.272184 0.285269 0.260939 0.218459 0.215067 0.224061 0.215171 0.206784 0.215388 0.205064 0.232704 0.377100 0.360212 0.363816 0.375205
chargesum: 0.00000
title: Mulliken charges with hydrogens summed into heavy atoms:
elementType: O O O O O C C C C C C C C C
charge: -0.222601 -0.128069 -0.082793 -0.080290 -0.065968 0.171682 0.084425 0.069458 0.013577 0.088318 0.042689 0.004711 0.037186 0.067675
polarizability: 1.19681986e+02 5.18000829e-01 1.04125083e+02 -3.06170316e+00 5.10618746e+00 1.07759099e+02
1716.lowfreq: -5.6665 0.0009 0.0010 0.0010 10.5562 15.1265 52.5679 68.2008 83.4187
frequency: 52.5039 68.1631 83.3600 102.1774 123.2547 149.9730 155.5046 183.6908 200.9119 231.2129 247.9698 260.4402 296.2276 319.8057 333.7941 371.5945 374.7798 441.1927 487.8356 549.4004 580.3296 594.8893 644.0948 674.8214 701.5726 762.5138 811.8743 843.3144 855.7041 899.0482 919.5531 949.2745 951.7098 982.1203 991.5348 1004.1931 1012.8412 1028.1058 1056.7426 1061.7329 1081.4102 1107.3442 1148.6303 1162.6635 1165.2030 1185.9225 1198.5221 1212.0177 1223.6365 1239.6142 1259.7982 1274.1280 1280.2711 1288.2603 1321.8887 1326.1736 1336.1057 1354.7744 1368.2629 1379.5914 1391.7657 1394.2751 1446.1098 1464.9211 1469.8841 1471.3989 1479.6092 1617.5478 2959.5022 2960.5527 2961.7043 2972.3506 2976.6681 2991.4140 3016.9051 3023.4147 3027.2946 3057.8421 3065.4596 3086.1662 3254.4293 3452.7902 3564.2328 3603.4154
redmass: 6.4086 3.7301 6.2807 4.6003 2.9613 4.0268 4.4061 4.5163 3.3064 3.8171 3.3772 4.7195 2.8595 1.2721 2.1759 2.0844 2.0853 4.0875 4.4131 3.8699 1.9181 1.7762 3.2037 4.3319 4.4034 2.7229 1.3634 2.2104 2.3192 3.2091 2.6579 2.0908 2.1109 2.7531 2.3193 2.8603 5.9615 2.4866 2.0823 2.2959 2.8590 2.0091 1.3967 1.2219 1.2387 1.2939 1.2989 1.6695 1.2040 1.1380 1.2155 1.3515 1.4581 1.5424 1.3145 1.5027 1.2530 1.4260 1.2083 1.3394 1.2693 1.2019 1.1724 1.0812 1.0839 1.0729 1.0859 10.1027 1.0666 1.0615 1.0663 1.0651 1.0768 1.0823 1.0873 1.1039 1.0870 1.0991 1.0999 1.0963 1.0674 1.0655 1.0666 1.0666
irintensity: 0.8110 2.2720 0.4421 4.7798 5.4170 15.2377 10.8130 1.6054 1.4882 20.5353 0.2641 4.1032 3.3383 101.6682 95.3901 123.8833 40.0584 6.5542 19.9138 6.9741 61.0899 141.2135 18.0241 0.3431 0.7788 1.8279 88.2938 82.8207 3.3031 9.1369 66.5155 20.0090 65.5523 48.4876 11.5723 13.4447 137.2229 62.0640 20.9586 17.5761 12.0284 6.1311 22.1254 18.2934 32.0095 13.9991 34.7403 2.1731 35.1724 4.0424 7.1480 27.1324 21.5856 15.3407 3.2175 4.7425 27.0570 13.0493 1.9920 7.7244 19.7259 52.8292 65.9416 7.7802 2.8066 4.9924 3.3360 170.1693 27.4183 80.5965 16.4155 61.3334 11.5803 42.1297 2.9964 40.8105 26.7755 30.6016 28.6066 50.0501 301.9961 43.4063 7.7256 17.0041
temp: 298.150 k
press: 1.00000 atm
elementType: 8 8 8 8 8 6 6 6 6 6 6 6 6 6 1 1 1 1 1 1 1 1 1 1 1 1 1 1 1 1
symmnumber: 1
zpe: 651866.9 jmol-1
zpe.correction: 0.248283 hartree
zpe.thermalcorrener: 0.263175 hartree
zpe.thermalcorrenthalpy: 0.264119 hartree
zpe.thermalcorrgfe: 0.206853 hartree
zpe.sumelectzpe: -727.502848 hartree
zpe.sumelectthermal: -727.487956 hartree
zpe.sumelectthermalent: -727.487012 hartree
zpe.sumelectthermalfe: -727.544277 hartree
dipole: 3.6640 -0.9882 -3.3717
dipole: 5.0764
quadrupole: -103.8123 -76.8616 -83.3008
quadrupole: -9.0453 -5.7425 8.1460
quadrupole: -15.8207 11.1300 4.6907 -9.0453 -5.7425 8.1460
hfenergy: -727.7511307 hartree
pointgroup: C01 [X(C9H16O5)]
dipole: -1.0510849 1.318611 1.0701944 debye
polarizability: 112.6846978|0.7864856|109.648042|-8.841451|4.4277192|109.2334273 unknown
InChI: InChI=1S/C9H16O5/c10-1-5-6(2-11)8(4-13)9(14)7(5)3-12/h5-8,10-13H,1-4H2
charge 0 multiplicity 1
30 atoms
O  1.169601 -1.83285 -1.315126
O  -0.285569 0.948785 2.555561
O  -1.132182 0.60884 -2.646669
O  3.314196 0.050088 -1.086284
O  -1.857736 -1.226199 2.191817
C  -0.210666 1.214485 0.107194
C  -1.4666 0.299789 -0.180507
C  1.051272 0.322043 -0.08116
C  -0.943676 -1.160323 -0.191235
C  0.508158 -1.008962 -0.62058
C  -0.25583 1.945019 1.452843
C  -2.10398 0.670751 -1.535139
C  2.137678 0.914447 -1.013334
C  -0.967178 -1.863828 1.245032
H  -0.184663 2.007787 -0.667844
H  -2.239907 0.410719 0.603033
H  1.524406 0.106997 0.900401
H  -1.504647 -1.80218 -0.894224
H  -1.160453 2.584176 1.513847
H  0.644973 2.581443 1.568057
H  -2.43809 1.722949 -1.527856
H  -2.98185 0.023984 -1.741814
H  2.50408 1.876886 -0.614672
H  1.695481 1.090457 -2.017371
H  0.064343 -1.910226 1.652868
H  -1.333542 -2.894527 1.117964
H  -0.089984 1.383253 3.42041
H  -0.958528 -0.336225 -2.887744
H  2.993601 -0.840346 -1.401129
H  -1.397506 -0.384834 2.500359
