program: Gaussian 09
title: 000222632
version: EM64L-G09RevD.01
frameworkgroup: C1[X(C20H23Cl3O3)]
method: RPBEPBE
basis: SDD
operation: Freq
keyword: #p
keyword: freq=noraman
keyword: PBEPBE/SDD
title: #p freq=noraman PBEPBE/SDD
converged: YES YES NO NO
title: Mulliken charges:
elementType: Cl Cl Cl O O O C C C C C C C C C C C C C C C C C C C C H H H H H H H H H H H H H H H H H H H H H H H
charge: -0.003121 -0.001878 -0.002544 -0.268573 -0.198351 -0.241980 0.362231 -0.218137 -0.377036 -0.543525 -0.442500 0.628263 -0.774754 -0.772018 -0.500575 -0.636851 -0.313753 0.235636 -0.106316 -0.706207 0.577667 -0.363534 -0.248720 -0.117747 -0.188256 -0.124943 0.240738 0.208904 0.224405 0.240632 0.214469 0.212923 0.236209 0.207824 0.212534 0.231630 0.204663 0.214811 0.221537 0.245543 0.228826 0.246654 0.234003 0.241922 0.248073 0.246391 0.229995 0.271219 0.283614
chargesum: 0.00000
title: Mulliken charges with hydrogens summed into heavy atoms:
elementType: Cl Cl Cl O O O C C C C C C C C C C C C C C C C C C C C
charge: -0.003121 -0.001878 -0.002544 -0.268573 -0.198351 -0.241980 0.362231 0.022602 -0.168131 -0.078488 -0.015108 0.628263 -0.118186 -0.120914 -0.279038 -0.162483 0.166904 0.235636 0.135606 0.018253 0.577667 -0.363534 0.022499 -0.117747 0.095358 -0.124943
polarizability: 3.00570748e+02 1.43518493e+01 2.73267739e+02 -2.02835252e+00 -1.19673976e+01 1.78798320e+02
1716.lowfreq: -9.7841 -0.0016 0.0012 0.0017 1.6460 4.7276 11.8013 14.2622 19.0451
frequency: 10.4377 13.7891 18.9871 24.5667 28.7167 51.2613 63.5899 78.3332 88.1587 97.1736 135.8592 147.8767 168.1867 173.4034 178.6178 182.3583 198.7049 213.4690 214.6677 218.9372 233.0836 252.4297 272.2360 287.3153 303.8885 315.8690 322.7718 339.2099 356.3993 370.1903 382.6338 408.1181 428.0055 444.3138 446.1886 453.4148 462.9821 486.4805 519.9998 568.5121 595.9153 607.3269 618.7009 641.3031 656.7802 684.3699 690.7742 697.8923 713.4026 757.9526 780.8188 807.6870 812.1893 824.8685 838.9178 844.2484 859.9921 863.0685 883.0375 894.0487 923.3185 936.2816 939.4453 949.8484 956.4381 971.7950 985.8804 1002.4191 1030.8250 1040.1711 1047.4481 1055.2043 1070.4670 1072.0628 1076.2309 1090.2363 1104.1087 1122.0186 1125.9995 1135.7540 1159.0045 1186.6629 1194.0277 1204.8439 1220.2199 1228.7771 1232.2813 1242.0936 1245.8042 1257.0314 1261.4463 1299.3528 1303.8643 1316.9771 1328.8234 1331.5818 1332.6920 1346.2679 1365.8213 1373.3092 1376.3579 1390.7539 1392.1622 1447.6356 1449.9220 1454.1202 1454.5138 1458.2713 1462.8141 1469.8977 1474.1092 1475.9889 1490.8107 1497.8758 1558.1131 1589.4822 1656.0797 1663.8862 2954.0183 2966.9084 2972.3687 2974.9807 2995.1558 2999.6306 3007.4599 3022.9580 3024.1477 3035.6688 3037.4167 3047.9619 3054.4139 3057.5347 3081.9580 3092.1445 3104.6520 3109.2133 3112.7260 3115.1278 3116.6584 3172.6603 3180.7067
redmass: 4.5411 6.9104 8.9064 3.9135 7.1201 7.5560 9.7583 4.1402 5.8401 5.0846 9.3414 1.0473 9.7939 3.0558 2.3181 21.3095 1.8310 1.5906 4.6862 1.5610 5.4314 3.3134 3.7113 3.7425 4.1279 2.7195 6.1458 3.4235 5.7036 2.9407 2.5138 2.9426 2.6683 4.2033 3.5438 3.3478 3.3148 3.1954 7.4366 4.8741 3.3531 10.0785 4.3059 4.7579 7.4345 3.5939 3.1568 4.4099 5.8928 2.6815 3.4492 2.3357 1.3182 3.4927 1.6336 2.8793 3.6856 1.3778 2.4063 2.3791 2.3395 1.7447 2.5810 1.6589 2.2193 1.7766 2.2656 1.4651 2.5081 4.0354 2.1746 2.0513 1.6672 1.9305 1.5190 1.4063 3.0683 1.9494 1.5059 2.2652 1.6349 1.7698 1.2291 1.8265 1.9376 2.1272 3.2568 1.4459 1.4104 1.2085 2.1908 1.8309 1.4736 1.4150 1.5564 1.4124 5.1833 1.9838 1.2647 9.4852 1.2266 1.2089 1.2058 1.0980 1.1000 2.8745 1.1068 1.0561 1.0524 1.0585 1.0682 1.0528 1.0739 1.0567 8.7636 8.7188 9.7940 6.8018 1.0602 1.0374 1.0379 1.0597 1.0995 1.0841 1.0349 1.0720 1.0802 1.0797 1.0763 1.0987 1.0971 1.0884 1.0972 1.0956 1.0928 1.1055 1.1074 1.1007 1.1015 1.0914 1.0930
irintensity: 0.0870 0.1502 0.1947 0.0639 0.1872 1.1483 0.1366 1.4739 0.3976 0.8408 0.8370 0.0237 0.7490 0.4408 0.6820 0.1405 0.3747 0.3656 3.6066 0.6325 1.3734 0.4695 0.2501 0.2050 5.7051 5.1738 2.2217 8.7146 3.3742 1.7592 0.0756 1.0844 3.1000 4.3161 5.7654 2.3067 5.2037 2.4143 11.5855 0.3798 1.7855 0.2015 2.9108 14.3842 34.8276 0.5097 3.4788 14.1549 25.0835 4.8578 9.2344 2.5990 8.5111 7.1255 7.9500 6.7086 10.0227 31.3746 5.5085 5.9532 3.6935 4.0500 20.6379 0.9172 3.7892 2.7372 34.0895 2.3544 38.0615 141.7810 2.2912 1.8945 39.8138 187.3386 95.7225 11.2840 131.1823 57.8989 2.2922 33.1880 1.4249 8.3101 7.6495 5.0646 5.6968 2.8078 115.2394 0.2148 1.5610 9.8993 5.8712 4.4113 9.5420 24.8952 3.0988 4.5485 83.6576 0.5328 3.9618 7.9569 18.7220 17.5870 28.2048 21.1883 15.7784 224.8004 15.8630 4.3462 16.9386 7.2693 3.9027 11.6608 12.2228 10.2481 2.5312 18.7426 160.7552 3.7720 54.9967 25.6061 53.5508 16.7804 26.4780 16.3788 11.1426 8.8041 52.1834 65.6097 30.1052 3.1526 40.0239 138.2752 34.0180 25.8956 40.5950 23.8595 11.8407 14.4504 12.2739 2.5754 0.8710
temp: 298.150 k
press: 1.00000 atm
elementType: 17 17 17 8 8 8 6 6 6 6 6 6 6 6 6 6 6 6 6 6 6 6 6 6 6 6 1 1 1 1 1 1 1 1 1 1 1 1 1 1 1 1 1 1 1 1 1 1 1
symmnumber: 1
zpe: 1005464.5 jmol-1
zpe.correction: 0.382961 hartree
zpe.thermalcorrener: 0.409839 hartree
zpe.thermalcorrenthalpy: 0.410783 hartree
zpe.thermalcorrgfe: 0.321546 hartree
zpe.sumelectzpe: -2379.771486 hartree
zpe.sumelectthermal: -2379.744608 hartree
zpe.sumelectthermalent: -2379.743664 hartree
zpe.sumelectthermalfe: -2379.832902 hartree
dipole: 4.1431 -1.6960 1.3687
dipole: 4.6813
quadrupole: -171.4973 -176.3298 -174.9957
quadrupole: -4.6794 -5.2612 -2.4705
quadrupole: 2.7769 -2.0555 -0.7214 -4.6794 -5.2612 -2.4705
hfenergy: -2380.1544471 hartree
pointgroup: C01[X(C20H23Cl3O3)]
dipole: -1.587945 0.3310226 0.872361 debye
polarizability: 296.6021805|20.8061838|263.9033943|-9.3760528|32.5546234|192.1312321 unknown
InChI: InChI=1S/C20H23Cl3O3/c1-11(26-18-10-16(22)15(21)9-17(18)23)19(24)25-7-6-12-4-5-13-8-14(12)20(13,2)3/h4,9-11,13-14H,5-8H2,1-3H3
charge 0 multiplicity 1
49 atoms
Cl 5.378268 2.097129 0.121491
Cl 1.415275 -2.805991 -1.100176
Cl 4.609297 -2.993176 -1.91065
O  -1.126661 1.988602 0.242963
O  0.534389 2.735731 -1.230246
O  2.488716 1.994577 0.749947
C  -3.086116 -1.26775 1.427322
C  -3.866881 -2.382674 0.602636
C  -2.264839 -1.053494 0.073401
C  -2.562014 -2.566615 -0.253359
C  -4.958741 -1.744331 -0.297637
C  -3.076093 -0.212845 -0.914758
C  -3.875548 -0.088691 2.020729
C  -2.206823 -1.876243 2.544275
C  -4.374999 -0.585101 -1.101609
C  -2.430007 0.943683 -1.653315
C  -2.183247 2.207195 -0.801553
C  0.180616 2.321186 -0.109273
C  1.078659 2.153917 1.133972
C  1.027398 3.4168 2.006476
C  2.89147 0.816801 0.125193
C  4.26417 0.717396 -0.227039
C  2.041586 -0.280562 -0.152602
C  2.556319 -1.438449 -0.769157
C  4.774886 -0.435438 -0.842332
C  3.917781 -1.523588 -1.116023
H  -4.253486 -3.249766 1.166691
H  -1.216488 -0.727622 0.162841
H  -1.839373 -3.260277 0.203293
H  -2.691301 -2.816571 -1.318795
H  -5.377321 -2.510543 -0.982896
H  -5.810601 -1.387488 0.319205
H  -4.536186 0.394597 1.282511
H  -4.500477 -0.431622 2.868008
H  -3.180614 0.68198 2.407024
H  -1.573869 -2.710057 2.195517
H  -1.538603 -1.103103 2.970975
H  -2.840775 -2.258699 3.367386
H  -5.023049 -0.061119 -1.817818
H  -1.465987 0.640337 -2.108073
H  -3.087904 1.261801 -2.487026
H  -1.856756 3.046323 -1.44159
H  -3.074718 2.481461 -0.21606
H  0.733826 1.273049 1.710726
H  1.384777 4.289001 1.434404
H  1.677233 3.28313 2.886823
H  -0.005856 3.600359 2.34568
H  0.978573 -0.251398 0.097297
H  5.833289 -0.492245 -1.108797
