program: Gaussian 09
title: 000217611
version: EM64L-G09RevD.01
frameworkgroup: C1[X(C12H19N3O)]
method: RPBEPBE
basis: SDD
operation: Freq
keyword: #p
keyword: freq=noraman
keyword: PBEPBE/SDD
title: #p freq=noraman PBEPBE/SDD
converged: YES YES NO NO
title: Mulliken charges:
elementType: O N N N C C C C C C C C C C C C H H H H H H H H H H H H H H H H H H H
charge: -0.240644 -0.193090 -0.138021 -0.067965 -0.309342 -0.436570 0.178735 0.155679 -0.189633 0.623414 -0.242303 -0.691406 -0.720322 -0.832909 -0.757472 -0.490190 0.243279 0.243379 0.244089 0.236885 0.225000 0.227452 0.224052 0.204471 0.191911 0.226012 0.227562 0.233199 0.268762 0.222442 0.222526 0.218762 0.212395 0.263051 0.216812
chargesum: 0.00000
title: Mulliken charges with hydrogens summed into heavy atoms:
elementType: O N N N C C C C C C C C C C C C
charge: -0.240644 -0.193090 -0.138021 -0.067965 -0.066063 0.050898 0.178735 0.155679 0.047251 0.623414 -0.017303 -0.035431 -0.074837 -0.108507 -0.316184 0.202068
polarizability: 2.06941486e+02 3.49288462e+00 1.39220539e+02 8.87318148e+00 6.40765738e+00 1.19738176e+02
1716.lowfreq: -8.2576 -0.0008 -0.0008 -0.0004 5.0431 9.0543 42.6600 64.4264 68.1311
frequency: 42.5813 64.4056 68.0478 89.0881 90.5326 126.1575 165.8955 189.7378 201.2600 208.1656 216.8456 234.5097 250.8584 257.8669 287.5015 300.3483 346.7899 354.5539 403.4992 417.5076 443.5428 477.8139 498.6001 523.4887 553.2861 590.3449 645.8736 673.2719 695.3255 702.6255 723.2193 736.4169 765.1344 842.5961 875.1041 903.6264 916.7683 919.9897 936.1751 946.1987 947.4917 981.7448 997.3424 1004.7397 1013.1714 1044.1563 1061.3136 1072.5920 1094.8243 1116.2081 1159.9568 1164.6460 1168.0897 1182.3793 1201.3289 1218.1803 1229.5233 1271.4603 1283.9186 1300.5011 1328.3936 1362.3369 1368.5262 1376.1398 1390.4830 1396.5967 1409.6941 1433.6839 1435.2070 1450.6218 1459.2588 1461.5409 1467.5962 1479.9987 1481.6514 1486.2533 1489.7344 1611.6963 1663.4305 1668.0231 2964.5561 2972.4672 2974.8753 2977.6448 2983.1938 3045.7583 3054.6152 3055.4235 3073.8089 3080.6589 3082.6577 3086.8869 3087.5449 3090.2592 3095.0399 3114.9586 3139.6188 3169.4813 3190.2329
redmass: 3.4191 3.4105 3.0096 2.9890 3.3181 3.7124 1.6419 2.3058 1.0847 1.0702 2.1389 2.4479 1.1168 2.7599 2.8834 2.8726 3.0861 3.5913 3.4677 3.7740 2.7289 3.4210 3.6389 5.3507 3.4749 2.4512 5.8872 5.8687 3.1896 2.0247 1.3336 3.0209 3.3789 3.7955 2.6895 1.3309 2.6596 2.1603 2.0469 1.5821 1.6534 1.9689 1.3293 2.2883 2.5738 1.7081 1.6277 2.0239 2.7361 1.3281 1.5677 2.4390 1.7166 1.4366 2.6998 2.4806 3.3821 1.6254 2.1886 2.7918 1.2051 1.2616 1.5827 2.3023 1.3498 1.2249 1.1361 1.1794 1.0550 1.0523 1.0505 1.0539 1.0605 1.0626 1.0578 1.0530 1.0815 8.7854 7.9712 5.1326 1.0656 1.0339 1.0365 1.0286 1.0353 1.0879 1.0967 1.0983 1.0999 1.1007 1.0992 1.0649 1.1040 1.0979 1.1002 1.1046 1.0858 1.1015 1.1136
irintensity: 0.0240 0.5582 0.6450 7.4240 2.4015 0.8237 0.7706 2.5216 0.8423 0.8675 5.8335 3.7413 0.8038 5.6345 2.2917 1.0011 1.1165 6.9686 5.8997 0.0716 1.0791 2.1260 0.7098 24.4915 3.1497 9.1772 23.5916 30.1636 28.5294 17.7620 0.0921 8.0757 3.0876 3.0982 11.3337 0.6354 6.0234 4.8661 4.9446 30.1303 44.8940 26.3727 1.5700 17.1429 15.9380 5.0934 12.0707 17.5384 4.1768 3.6419 6.4771 21.1758 5.9358 56.7585 19.5345 26.6883 45.5769 98.9162 1.5980 5.2010 8.1877 18.2857 75.6707 66.4859 22.6731 20.7316 3.8893 1.3485 13.9710 2.8428 2.5504 17.3387 6.2270 15.3304 12.0321 12.4435 44.3185 46.7546 274.5473 85.4281 74.4814 22.1343 23.5729 64.3159 37.0851 41.2145 10.3137 24.7244 17.4035 28.6203 50.3367 12.7972 27.7745 22.9865 33.3425 17.1559 1.2154 24.3236 20.5027
temp: 298.150 k
press: 1.00000 atm
elementType: 8 7 7 7 6 6 6 6 6 6 6 6 6 6 6 6 1 1 1 1 1 1 1 1 1 1 1 1 1 1 1 1 1 1 1
symmnumber: 1
zpe: 769555.7 jmol-1
zpe.correction: 0.293108 hartree
zpe.thermalcorrener: 0.310126 hartree
zpe.thermalcorrenthalpy: 0.311070 hartree
zpe.thermalcorrgfe: 0.249311 hartree
zpe.sumelectzpe: -706.812780 hartree
zpe.sumelectthermal: -706.795763 hartree
zpe.sumelectthermalent: -706.794819 hartree
zpe.sumelectthermalfe: -706.856578 hartree
dipole: -1.0356 -1.9679 -1.3602
dipole: 2.6068
quadrupole: -93.7614 -90.8342 -94.7796
quadrupole: -0.7671 2.4275 1.2779
quadrupole: -0.6363 2.2909 -1.6545 -0.7671 2.4275 1.2779
hfenergy: -707.1058887 hartree
pointgroup: C01 [X(C12H19N3O1)]
dipole: 0.3653607 0.8179841 -0.4992211 debye
polarizability: 206.4804321|9.2461217|140.5554045|-4.6170564|-6.1647234|118.864365 unknown
InChI: InChI=1S/C12H19N3O/c1-9(2)10-8-14-7-6-12(3,4)13-11(14)15(10)16-5/h6-7,10H,1,8H2,2-5H3
charge 0 multiplicity 1
35 atoms
O  1.553857 -1.785021 0.07117
N  -0.257963 1.194975 -0.650892
N  1.076073 -0.650866 -0.718301
N  -1.261862 -0.960551 -0.121065
C  2.02489 0.511941 -0.712493
C  1.052328 1.666135 -1.139516
C  -0.245496 -0.204197 -0.419074
C  -2.573512 -0.252144 0.148457
C  -1.51532 1.775114 -0.920017
C  2.730489 0.764159 0.624086
C  -2.64854 1.093734 -0.58658
C  -2.675895 -0.023249 1.684606
C  -3.70552 -1.195618 -0.319141
C  1.876248 0.818628 1.87498
C  4.07737 0.93929 0.638597
C  1.218647 -3.039433 -0.640074
H  2.79004 0.356895 -1.491862
H  1.340967 2.626467 -0.678771
H  1.054124 1.780082 -2.242711
H  -1.511361 2.751016 -1.414706
H  -3.630238 1.511089 -0.831641
H  -2.566004 -0.988701 2.211966
H  -1.876593 0.657367 2.028773
H  -3.653099 0.42157 1.950788
H  -4.698688 -0.758956 -0.103539
H  -3.627994 -1.383658 -1.404161
H  -3.622571 -2.163784 0.204637
H  1.051746 1.550205 1.775862
H  1.410921 -0.168384 2.057268
H  2.480373 1.087684 2.757816
H  4.618059 1.156376 1.566785
H  4.680272 0.861469 -0.274802
H  1.652124 -3.037371 -1.656973
H  0.123344 -3.162161 -0.683139
H  1.679384 -3.827804 -0.021935
