program: Gaussian 09
title: 000222580
version: EM64L-G09RevD.01
frameworkgroup: C1[X(C17H14O3)]
method: RPBEPBE
basis: SDD
operation: Freq
keyword: #pfreq=noraman
keyword: PBEPBE/SDD
title: #p freq=noraman PBEPBE/SDD
converged: YES YES NO NO
title: Mulliken charges:
elementType: O O O C C C C C C C C C C C C C C C C C H H H H H H H H H H H H H H
charge: -0.218233 -0.407109 -0.226962 0.337103 -0.675652 -0.042808 -0.404812 0.325571 0.408998 -0.325013 -0.370244 -0.398565 -0.363564 0.197728 -0.235485 -0.236084 -0.240727 -0.232948 -0.229595 -0.240915 0.266932 0.303748 0.221276 0.267528 0.272227 0.233144 0.255609 0.230211 0.230405 0.228390 0.230395 0.229693 0.230706 0.379052
chargesum: 0.00000
title: Mulliken charges with hydrogens summed into heavy atoms:
elementType: O O O C C C C C C C C C C C C C C C C C
charge: -0.218233 -0.028057 -0.226962 0.337103 -0.104972 -0.042808 -0.183536 0.325571 0.408998 -0.057485 -0.098017 -0.165420 -0.107955 0.197728 -0.005274 -0.005679 -0.012337 -0.002553 0.000098 -0.010210
polarizability: 2.27788957e+02 9.38696340e+00 1.85699336e+02 -1.94367304e+01 1.31955430e+01 1.62286053e+02
1716.lowfreq: -11.5419 -2.8422 -2.1995 -0.0008 -0.0003 -0.0002 13.6399 25.4080 28.1341
frequency: 13.0611 25.2565 28.0703 41.1863 51.5364 56.8755 90.7959 115.5092 145.2135 168.0798 206.9697 258.7708 287.4944 301.6104 325.3879 400.7055 403.0289 409.9683 416.1725 484.8825 487.1057 497.7366 524.8371 585.8457 612.8509 614.4502 624.5384 643.4167 648.9230 690.5761 698.0538 708.3041 744.1337 765.0964 806.7172 836.0924 841.2070 849.1031 856.8206 900.1247 932.2826 940.2753 953.9618 958.5204 976.2717 987.3196 988.9674 990.9914 996.6949 1004.8236 1025.8769 1028.1208 1049.5073 1083.9650 1086.1936 1141.5886 1173.0002 1174.2130 1183.6816 1188.8503 1194.0603 1232.3188 1244.6222 1256.1927 1317.1257 1323.9764 1336.7216 1367.4486 1386.9662 1393.3203 1430.2025 1435.5037 1439.4802 1476.7257 1482.8566 1525.3067 1581.3529 1588.1841 1607.8637 1610.3667 1635.4670 1662.4237 3003.2467 3062.2211 3070.0182 3118.6090 3126.9382 3130.4585 3138.6912 3143.2035 3151.0602 3155.8443 3162.1664 3168.5036 3174.3327 3512.6818
redmass: 7.7754 4.4603 6.1512 6.3993 4.2588 5.6453 7.4531 5.0140 5.7004 5.1241 4.8668 2.9420 6.7250 4.4826 4.5212 2.8051 2.9440 4.6179 4.9967 2.1486 3.3193 3.5662 4.1401 5.2843 6.4006 6.1024 2.7042 1.9719 4.7407 2.2126 1.7893 3.0328 2.6059 1.8526 3.0785 3.7785 2.7020 1.4105 1.2513 1.5435 1.7428 1.8820 2.1438 3.0146 1.4187 1.8345 4.0891 3.5833 1.3401 1.3517 2.1273 2.1534 2.4717 1.5930 1.6250 2.4285 1.0610 1.0551 1.1867 1.1906 1.1134 2.1055 2.0070 2.4240 1.3410 1.4772 2.1422 2.5249 8.1056 2.8842 1.1946 2.1156 2.0612 2.2329 2.3015 9.7295 5.7761 6.2607 5.9862 6.0156 8.1827 8.2005 1.0608 1.0986 1.0883 1.0872 1.0852 1.0867 1.0887 1.0921 1.0936 1.0958 1.0978 1.1010 1.0979 1.0640
irintensity: 1.0899 0.0850 1.5194 0.8501 0.9544 1.8497 2.1917 0.5719 1.1081 2.7170 2.0455 0.7782 3.3973 6.5493 1.2030 0.5645 0.3475 2.2418 4.1856 24.9285 41.9805 26.8932 21.3210 10.1869 0.4886 0.1587 40.9820 81.7543 12.2462 27.5648 66.9086 18.7053 57.5946 42.9249 10.0612 6.5021 9.3646 1.0974 0.3177 3.5414 8.8276 23.4030 7.5687 44.1535 0.7691 0.3022 0.2369 0.5245 0.9810 1.6859 7.1047 15.3628 365.2899 16.4986 2.7579 5.6217 1.4609 0.1569 16.6203 4.9360 0.9662 11.1685 74.6507 72.4635 0.9555 13.5909 77.1377 23.3461 4.2372 7.1673 68.4626 13.5702 16.6330 0.9099 6.6702 159.5604 2.4059 5.0743 13.8890 1.3250 19.2898 191.0319 14.9866 0.8669 25.0044 6.7392 0.4885 0.7816 9.2500 18.2230 14.4431 34.6925 24.8274 15.5166 8.5519 28.2126
temp: 298.150 k
press: 1.00000 atm
elementType: 8 8 8 6 6 6 6 6 6 6 6 6 6 6 6 6 6 6 6 6 1 1 1 1 1 1 1 1 1 1 1 1 1 1
symmnumber: 1
zpe: 685927.2 jmol-1
zpe.correction: 0.261256 hartree
zpe.thermalcorrener: 0.279011 hartree
zpe.thermalcorrenthalpy: 0.279955 hartree
zpe.thermalcorrgfe: 0.211540 hartree
zpe.sumelectzpe: -880.475828 hartree
zpe.sumelectthermal: -880.458073 hartree
zpe.sumelectthermalent: -880.457129 hartree
zpe.sumelectthermalfe: -880.525544 hartree
dipole: 1.7430 -1.1079 -2.2221
dipole: 3.0337
quadrupole: -101.6756 -106.3578 -117.3816
quadrupole: 6.9327 4.5500 3.5693
quadrupole: 6.7961 2.1139 -8.9099 6.9327 4.5500 3.5693
hfenergy: -880.7370839 hartree
pointgroup: C01 [X(C17H14O3)]
dipole: -0.6049534 -0.5228378 0.8861144 debye
polarizability: 230.9645309|9.8450217|178.6496362|-4.282256|-21.081114|166.1601793 unknown
InChI: InChI=1S/C17H14O3/c18-16(19)12-15(11-13-7-3-1-4-8-13)17(20)14-9-5-2-6-10-14/h1-11,18H,12H2
charge 0 multiplicity 1
34 atoms
O  1.482935 1.016559 -2.111807
O  4.869337 0.961157 1.066063
O  2.720148 1.488601 1.767871
C  1.562956 -0.353877 -0.149556
C  3.071224 -0.21958 -0.007097
C  0.934016 0.728496 -0.997873
C  0.914279 -1.431629 0.395464
C  -0.256435 1.494557 -0.509819
C  -0.489681 -1.867106 0.25447
C  -0.606366 1.541101 0.865338
C  -1.012418 2.243572 -1.452534
C  -1.06366 -2.650713 1.296836
C  -1.282136 -1.592398 -0.896415
C  3.475042 0.824837 1.025314
C  -1.710955 2.311381 1.285672
C  -2.12017 3.003477 -1.031101
C  -2.396685 -3.102495 1.217496
C  -2.612963 -2.05038 -0.979227
C  -2.474129 3.036223 0.340794
C  -3.18003 -2.799275 0.078907
H  3.546293 -1.175784 0.278258
H  3.510832 0.075456 -0.979038
H  1.53201 -2.105944 1.010164
H  0.007377 1.006644 1.596041
H  -0.70851 2.216113 -2.504537
H  -0.458736 -2.892564 2.179704
H  -0.845837 -1.051405 -1.741766
H  -1.972674 2.353333 2.348523
H  -2.706335 3.571396 -1.76198
H  -2.822498 -3.693765 2.03567
H  -3.2057 -1.832724 -1.874496
H  -3.334542 3.629906 0.670411
H  -4.213987 -3.155088 0.010186
H  5.112502 1.647818 1.745064
