program: Gaussian 09
title: 000222555
version: EM64L-G09RevD.01
frameworkgroup: C1[X(C4H6Br4)]
method: RPBEPBE
basis: SDD
operation: Freq
keyword: #pfreq=noraman
keyword: PBEPBE/SDD
title: #p freq=noraman PBEPBE/SDD
converged: YES YES NO NO
title: Mulliken charges:
elementType: Br Br Br Br C C C C H H H H H H
charge: 0.070085 0.056358 0.002527 0.056237 -0.122175 -0.653399 -0.631431 -0.653081 0.304046 0.307258 0.326365 0.326155 0.304050 0.307004
chargesum: 0.00000
title: Mulliken charges with hydrogens summed into heavy atoms:
elementType: Br Br Br Br C C C C
charge: 0.070085 0.056358 0.002527 0.056237 -0.122175 -0.042095 0.021089 -0.042026
polarizability: 1.24516449e+02 1.40280824e-01 1.24255435e+02 6.36539359e-02 1.07439050e+01 7.40227258e+01
1716.lowfreq: -10.1750 -6.7961 -0.0001 0.0001 0.0001 5.1198 40.8333 53.7646 71.8655
frequency: 40.8296 53.7644 71.8641 98.7291 151.2209 176.2625 203.6054 204.6705 284.4229 307.0978 455.7232 504.1472 589.6958 600.7403 696.9886 809.3901 815.3784 889.1988 932.0865 1016.7067 1134.6645 1137.4656 1188.5873 1231.8252 1245.2651 1263.7089 1286.5460 1409.6503 1425.6157 1429.4222 3043.8356 3050.3478 3083.0225 3133.8895 3140.0296 3174.9953
redmass: 39.0909 25.3242 37.5925 22.9691 16.3298 18.0444 4.8062 2.9865 2.4623 3.3882 3.6357 3.7685 5.4909 4.5107 5.3007 3.5775 1.4875 1.6203 1.7987 1.8695 2.2484 1.0490 1.2125 1.3980 1.1839 1.3525 1.4078 1.0928 1.0880 1.0971 1.0568 1.0570 1.0562 1.1087 1.1082 1.1115
irintensity: 0.1739 0.3350 0.2877 0.0520 2.3355 0.5108 5.9715 3.3742 4.0033 4.3964 11.1435 51.8568 26.7858 22.3801 0.1924 7.0378 12.0598 18.7384 53.8432 2.0533 12.6728 0.5404 3.2710 10.4306 8.0325 17.0606 9.1890 5.7093 29.1086 25.8524 3.8765 10.0778 1.2071 0.0726 1.1606 0.7488
temp: 298.150 k
press: 1.00000 atm
elementType: 35 35 35 35 6 6 6 6 1 1 1 1 1 1
symmnumber: 1
zpe: 240936.2 jmol-1
zpe.correction: 0.091768 hartree
zpe.thermalcorrener: 0.102351 hartree
zpe.thermalcorrenthalpy: 0.103295 hartree
zpe.thermalcorrgfe: 0.050806 hartree
zpe.sumelectzpe: -209.220235 hartree
zpe.sumelectthermal: -209.209652 hartree
zpe.sumelectthermalent: -209.208708 hartree
zpe.sumelectthermalfe: -209.261197 hartree
dipole: -0.0051 -0.1925 1.8566
dipole: 1.8666
quadrupole: -93.9112 -91.3524 -79.3036
quadrupole: -0.0046 0.0014 0.2285
quadrupole: -5.7221 -3.1633 8.8854 -0.0046 0.0014 0.2285
hfenergy: -209.312003 hartree
pointgroup: C01 [X(C4H6Br4)]
dipole: -0.0080601 0.1731148 0.7136385 debye
dipolederiv: -0.0728598 0.0257332 -0.0105361 0.0251061 -0.6310388 0.2349893 -0.0055198 0.1253645 -0.2317173 -0.4997741 -0.013316 -0.0282031 -0.0279882 -0.0505776 -0.0217264 -0.1213165 -0.0323121 -0.0980065 -0.1000789 0.0237467 -0.0023681 0.0238735 -0.6382987 0.0572161 -0.0058066 0.1335569 -0.1619104 -0.5007109 -0.0290495 0.0281641 -0.0142549 -0.0508276 -0.0191178 0.1220033 -0.0209326 -0.0972704 -0.0597693 -0.0337723 0.0144966 -0.0340212 0.6842189 -0.3301498 0.0091008 -0.1941267 0.2313009 0.6343324 0.0896447 0.1273155 0.0109974 -0.0961013 0.0663684 0.1719767 0.0371712 0.0388938 -0.0925326 -0.0410001 0.0083315 -0.0409733 0.8285059 -0.1980078 0.0078574 -0.1925283 -0.0000825 0.6388602 -0.0207104 -0.1300354 0.0584922 -0.0998656 0.0547557 -0.1721268 0.0206196 0.0380897 -0.0212019 0.0040595 -0.0623499 -0.0062859 0.0390558 0.0841658 -0.0577932 0.0855651 0.0323342 -0.0137715 -0.0379618 -0.0757868 0.0028642 0.01762 -0.0867159 -0.0544917 -0.0697766 0.0308907 0.0651502 -0.0370004 -0.0814375 0.0085854 -0.0330529 0.0705736 -0.0685765 0.0373449 0.0762097 0.0609647 0.0451396 0.0748724 -0.0005336 -0.0293516 0.0776176 0.0650063 0.0437197 0.0771753 -0.0213104 -0.0101287 0.053815 0.0002022 0.0386461 0.0894552 0.0490093 0.0907381 0.0333959 -0.0172981 0.0346156 0.0837219 -0.0060639 0.0210674 -0.0794241 0.0606773 -0.0644037 0.0306971 unknown
polarizability: 124.4900102|0.3648836|120.5092356|0.8648946|-17.0281256|77.7953647 unknown
InChI: InChI=1S/C4H6Br4/c5-1-4(8,2-6)3-7/h1-3H2
charge 0 multiplicity 1
14 atoms
Br -0.083752 2.014249 -1.028253
Br -3.010394 0.117526 0.031008
Br 0.125014 -2.674762 -0.133583
Br 2.999591 0.40015 0.044684
C  -0.006115 0.271307 0.070976
C  -1.244744 0.234501 0.992435
C  0.046846 -0.827611 -0.994476
C  1.22649 0.346824 0.998135
H  -1.216319 -0.669388 1.623169
H  -1.308927 1.144156 1.607064
H  -0.862144 -0.840078 -1.61037
H  0.95852 -0.759714 -1.602762
H  1.28021 -0.558867 1.624564
H  1.202425 1.255505 1.617112
