program: Gaussian 09
title: 000222560
version: EM64L-G09RevD.01
frameworkgroup: C1[X(C9H19NO)]
method: RPBEPBE
basis: SDD
operation: Freq
keyword: #p
keyword: freq=noraman
keyword: PBEPBE/SDD
title: #p freq=noraman PBEPBE/SDD
converged: NO YES NO NO
title: Mulliken charges:
elementType: O N C C C C C C C C C H H H H H H H H H H H H H H H H H H H
charge: -0.262455 -0.612366 0.376362 0.316014 -0.569495 -0.789014 -0.794202 -0.755396 -0.755883 -0.753495 0.194056 0.198292 0.248289 0.216745 0.202385 0.278366 0.240380 0.215310 0.215351 0.232917 0.211861 0.207346 0.201832 0.230381 0.212536 0.223768 0.210314 0.217532 0.311454 0.330817
chargesum: 0.00000
title: Mulliken charges with hydrogens summed into heavy atoms:
elementType: O N C C C C C C C C C
charge: -0.262455 0.029905 0.376362 0.316014 -0.122914 -0.091519 -0.123162 -0.103272 -0.111134 -0.101882 0.194056
polarizability: 1.19919551e+02 1.06067862e+00 1.06839617e+02 -2.69648474e+00 -2.06504263e+00 9.30751442e+01
1716.lowfreq: -21.9086 -7.6264 0.0003 0.0004 0.0005 2.5951 39.2124 76.5780 109.2782
frequency: 38.8559 76.3458 109.2597 150.5837 203.5369 224.6076 241.4485 245.8895 262.0074 277.7050 300.2217 312.3485 344.9906 359.8453 369.0383 377.4931 409.8687 456.1017 463.0804 474.4264 499.5087 536.2283 579.2223 648.7749 726.6654 785.8837 847.9538 888.0271 903.4919 920.2847 924.3279 934.5564 941.3507 954.6584 995.7613 1021.1751 1023.0900 1049.8925 1126.5121 1153.5591 1184.4863 1210.3149 1229.4507 1232.4614 1258.4328 1293.7903 1347.6911 1373.6554 1377.1793 1385.9949 1393.8138 1410.1806 1450.0110 1459.8353 1461.7345 1468.5459 1470.5524 1480.0451 1486.3462 1489.1157 1490.5103 1500.4840 1501.2488 1589.7628 1634.0278 2970.8361 2974.4584 2977.7256 2979.6910 2983.8246 2996.1983 3057.1139 3061.2408 3065.5183 3068.7269 3071.0221 3072.8783 3075.7170 3076.4231 3079.5963 3084.0207 3089.1544 3515.2415 3674.0419
redmass: 4.8907 3.0139 2.6632 3.4828 1.0830 1.8449 1.5202 1.1178 1.3068 1.2376 2.1560 2.0834 1.9430 2.2401 2.2168 2.1923 2.1573 2.6908 2.3251 1.9665 1.2446 2.4158 2.0053 1.7900 3.2161 3.2646 2.5168 2.5581 1.9799 1.6578 1.6939 1.3667 1.2678 1.9865 1.3278 1.3727 1.4162 1.6132 1.8256 1.9066 2.6157 2.3117 2.4869 3.1600 2.2468 1.4718 2.8244 1.2132 1.2209 1.1896 1.2074 1.1943 1.1042 1.0543 1.0475 1.0556 1.0483 1.0536 1.0523 1.0549 1.0548 1.0596 1.0537 1.5686 2.8269 1.0357 1.0356 1.0357 1.0358 1.0373 1.0592 1.0990 1.0993 1.1004 1.0985 1.0986 1.0994 1.0989 1.0982 1.0980 1.0988 1.0990 1.0448 1.1040
irintensity: 11.0195 3.1720 4.7901 1.2068 0.0259 1.3106 0.3894 0.1279 0.9113 0.1768 0.1302 0.8637 0.2126 0.1480 0.4873 0.3846 2.2029 0.1154 0.7127 3.6576 144.5160 55.9990 38.7794 53.2988 14.5720 3.1186 0.9975 0.5262 0.7848 0.7059 2.6763 1.8548 0.7157 0.8024 0.3562 0.8817 2.0870 0.4979 7.6254 35.0547 19.0271 25.5250 21.1698 3.6090 22.5517 9.5544 134.0932 7.0798 32.5993 38.3904 46.4487 6.0738 8.3688 2.6774 1.9092 0.3536 0.9412 4.9841 16.9031 23.9082 13.4313 6.1505 12.9819 63.3395 258.1021 23.4630 32.6008 36.0427 24.3488 30.4326 22.5850 9.0478 7.6573 2.2362 53.9110 71.3955 10.1811 41.5202 104.9457 0.7914 49.7288 14.2166 27.2630 19.3975
temp: 298.150 k
press: 1.00000 atm
elementType: 8 7 6 6 6 6 6 6 6 6 6 1 1 1 1 1 1 1 1 1 1 1 1 1 1 1 1 1 1 1
symmnumber: 1
zpe: 701081.5 jmol-1
zpe.correction: 0.267028 hartree
zpe.thermalcorrener: 0.280824 hartree
zpe.thermalcorrenthalpy: 0.281768 hartree
zpe.thermalcorrgfe: 0.228318 hartree
zpe.sumelectzpe: -483.430058 hartree
zpe.sumelectthermal: -483.416261 hartree
zpe.sumelectthermalent: -483.415317 hartree
zpe.sumelectthermalfe: -483.468767 hartree
dipole: 1.2940 -3.6452 0.5719
dipole: 3.9101
quadrupole: -72.6319 -69.6130 -70.9437
quadrupole: 11.6220 -3.3467 0.2172
quadrupole: -1.5690 1.4499 0.1191 11.6220 -3.3467 0.2172
hfenergy: -483.6970856 hartree
pointgroup: C01 [X(C9H19N1O1)]
dipole: -0.5495071 -1.3239597 0.5583007 debye
polarizability: 119.5852037|-3.0294478|105.2411401|-2.624443|-4.9367393|95.0079684 unknown
InChI: InChI=1S/C9H19NO/c1-8(2,3)9(4,5)6-7(10)11/h6,10H2,1-5H3
charge 0 multiplicity 1
30 atoms
O  2.862346 0.921595 -0.379412
N  2.883177 -1.257114 0.393721
C  -0.276236 0.134265 -0.438478
C  -1.729517 -0.077646 0.205787
C  0.812652 0.059277 0.700039
C  -0.164877 1.521135 -1.134908
C  0.026648 -0.961374 -1.500729
C  -2.843091 0.289574 -0.817578
C  -1.956613 -1.556802 0.634828
C  -1.931257 0.819814 1.462194
C  2.253242 -0.036085 0.188855
H  0.597428 -0.797184 1.366776
H  0.753643 0.97899 1.308904
H  -0.767454 1.55123 -2.060007
H  -0.504433 2.342177 -0.477062
H  0.887628 1.72328 -1.398045
H  0.96681 -0.726724 -2.03185
H  0.136428 -1.964486 -1.050185
H  -0.774972 -1.015154 -2.259106
H  -2.850705 1.370295 -1.042679
H  -2.729945 -0.25827 -1.770724
H  -3.833525 0.027954 -0.399077
H  -1.161522 -1.928326 1.308336
H  -2.009104 -2.232531 -0.237168
H  -2.914996 -1.643238 1.180824
H  -1.2941 0.501082 2.306682
H  -2.982432 0.754618 1.80124
H  -1.715973 1.883187 1.251688
H  2.412111 -2.044688 0.83381
H  3.843841 -1.368552 0.068423
