program: Gaussian 09
title: 000222565
version: EM64L-G09RevD.01
frameworkgroup: C1[X(C14H12N2O3)]
method: RPBEPBE
basis: SDD
operation: Freq
keyword: #p
keyword: freq=noraman
keyword: PBEPBE/SDD
title: #p freq=noraman PBEPBE/SDD
converged: YES YES NO NO
title: Mulliken charges:
elementType: O O O N N C C C C C C C C C C C C C C H H H H H H H H H H H H
charge: -0.263130 -0.198173 -0.207692 -0.470904 0.020881 0.492885 0.299678 0.449671 0.133254 -0.340000 -0.450173 -0.379459 -0.369371 -0.476644 -0.350891 0.368477 -0.185321 -0.360173 -0.807279 0.316924 0.306819 0.220618 0.269033 0.232336 0.233350 0.287539 0.246808 0.291587 0.224438 0.227667 0.237244
chargesum: 0.00000
title: Mulliken charges with hydrogens summed into heavy atoms:
elementType: O O O N N C C C C C C C C C C C C C C
charge: -0.263130 -0.198173 -0.207692 -0.153980 0.020881 0.492885 0.299678 0.449671 0.133254 -0.033181 -0.229554 -0.147123 -0.136021 -0.207610 -0.063353 0.368477 0.061487 -0.068586 -0.117929
polarizability: 3.20961257e+02 -1.39378611e+01 1.94151334e+02 -5.53243479e+00 -3.83353784e+00 7.65510482e+01
1716.lowfreq: -6.4303 -3.9918 -3.1975 -0.0007 -0.0005 -0.0002 14.3500 21.9868 32.8469
frequency: 14.2444 21.9012 32.8374 51.3358 62.6180 74.6163 128.7070 147.5506 172.3563 196.4835 226.0443 277.3662 318.2818 341.4643 349.3389 379.9714 408.1743 417.6909 430.8882 469.7534 510.3842 519.7354 542.7342 633.0695 639.5518 647.4567 656.5717 691.4057 695.9503 716.3677 737.4370 753.1654 799.5597 822.2883 832.3500 841.5046 853.9485 893.1138 928.7339 945.8690 968.1789 987.2907 988.6154 989.4880 1008.4009 1013.6448 1046.4092 1073.5075 1089.4415 1112.0513 1130.3004 1172.6575 1193.2059 1212.1684 1223.4289 1244.7266 1258.7730 1292.2056 1313.9819 1369.4811 1373.4134 1396.0404 1397.8548 1410.4890 1430.4292 1465.8704 1472.4411 1473.3957 1507.1994 1513.1896 1571.3301 1596.3207 1607.3069 1614.0782 1626.6549 2974.3977 3055.4572 3085.1671 3106.3718 3128.8410 3138.8164 3153.4894 3155.6238 3171.0641 3188.2233 3196.1953 3531.2183
redmass: 1.0217 4.4623 5.5105 7.4369 8.2414 6.0350 4.7900 5.7204 4.9504 4.9206 6.6890 4.3970 5.1374 5.0921 5.5675 4.1438 2.9355 3.3113 6.7928 5.4203 5.0368 2.8947 5.5204 5.7186 1.5354 4.3891 4.6505 7.7531 2.5282 2.9853 6.1475 5.2793 7.7844 1.4787 1.4888 5.4335 1.2882 6.7282 1.5854 1.3495 1.3828 1.4225 3.7176 1.5267 2.9549 1.3705 1.5545 2.0234 1.8253 2.5108 1.3432 1.1403 1.1211 6.8467 2.6083 4.3563 1.9938 1.3564 1.4220 5.3561 9.6133 6.5176 1.2322 3.7365 3.3551 1.5028 1.5641 1.0870 2.4578 2.2835 6.7464 5.4865 4.8034 7.1108 6.3880 1.0389 1.0947 1.0998 1.0882 1.0911 1.0958 1.0882 1.0913 1.0943 1.0971 1.0944 1.0759
irintensity: 0.4925 3.7189 0.6146 0.8622 1.4385 4.5286 5.3968 5.3628 0.5639 0.6527 1.2356 0.0531 8.3911 2.6021 0.3463 0.2420 0.1036 0.6821 1.7878 6.5552 10.7497 31.0822 2.4120 1.9881 26.4645 5.7073 9.4011 32.6299 61.7257 1.2924 8.8124 3.4927 7.4011 60.1110 28.1804 2.5047 22.4961 9.9881 18.9612 5.5326 1.6853 1.8865 1.2568 3.1881 2.2129 2.7291 22.4206 25.7595 25.0163 29.9977 12.8644 29.9496 2.7989 282.3619 1.9012 26.4159 23.0766 2.0872 26.8104 22.4364 172.2315 0.8891 6.5270 23.6932 11.5010 87.7360 13.8755 12.2466 16.3086 364.8020 55.9724 60.2774 80.1570 0.9373 0.0419 42.9725 23.2772 17.5894 17.3836 23.4285 16.7030 6.1856 4.5999 6.5517 2.8939 5.0034 10.2347
temp: 298.150 k
press: 1.00000 atm
elementType: 8 8 8 7 7 6 6 6 6 6 6 6 6 6 6 6 6 6 6 1 1 1 1 1 1 1 1 1 1 1 1
symmnumber: 1
zpe: 611361.5 jmol-1
zpe.correction: 0.232855 hartree
zpe.thermalcorrener: 0.249606 hartree
zpe.thermalcorrenthalpy: 0.250550 hartree
zpe.thermalcorrgfe: 0.184681 hartree
zpe.sumelectzpe: -874.469818 hartree
zpe.sumelectthermal: -874.453067 hartree
zpe.sumelectthermalent: -874.452123 hartree
zpe.sumelectthermalfe: -874.517992 hartree
dipole: 2.1280 1.0478 1.3407
dipole: 2.7246
quadrupole: -104.3425 -114.7089 -113.2235
quadrupole: -23.2278 -2.2758 -0.9116
quadrupole: 6.4158 -3.9506 -2.4652 -23.2278 -2.2758 -0.9116
hfenergy: -874.702673 hartree
pointgroup: C01[X(C14H12N2O3)]
dipole: -0.8778746 -0.5098339 -0.3442209 debye
polarizability: 317.3842815|-34.1562365|84.2271068|-3.5168803|19.3026941|190.0522507 unknown
InChI: InChI=1S/C14H12N2O3/c1-10-5-7-12(8-6-10)15-14(17)11-3-2-4-13(9-11)16(18)19/h2-9,15H,1H3
charge 0 multiplicity 1
31 atoms
O  -0.555748 -0.303598 -2.292494
O  5.221653 -0.363622 2.024346
O  3.196641 0.30954 2.829263
N  -0.965313 -0.275889 0.021272
N  3.954732 -0.16046 1.894349
C  -2.371544 -0.0388 0.068926
C  1.329451 -0.581502 -0.799534
C  -5.179678 0.437212 0.335247
C  -0.140454 -0.369417 -1.093253
C  -3.169777 0.169284 -1.086619
C  -2.980825 -0.006421 1.351524
C  -4.552119 0.405554 -0.936105
C  -4.363075 0.229387 1.477242
C  1.94065 -0.270881 0.437679
C  2.129922 -1.084876 -1.859602
C  3.324953 -0.492511 0.589416
C  3.512768 -1.299726 -1.683587
C  4.129627 -1.007783 -0.448616
C  -6.675429 0.660157 0.470221
H  -0.528521 -0.428391 0.932925
H  -2.704421 0.143774 -2.073063
H  -2.371857 -0.15907 2.25268
H  1.402815 0.172108 1.28211
H  -5.157822 0.569381 -1.835715
H  -4.813811 0.254655 2.476421
H  1.63775 -1.287478 -2.816132
H  4.112781 -1.693291 -2.509776
H  5.198608 -1.160095 -0.278945
H  -6.930847 1.126768 1.437909
H  -7.062054 1.310007 -0.334508
H  -7.22836 -0.297817 0.411321
