program: Gaussian 09
title: 000222562
version: EM64L-G09RevD.01
frameworkgroup: C1[X(C11H14O)]
method: RPBEPBE
basis: SDD
operation: Freq
keyword: #pfreq=noraman
keyword: PBEPBE/SDD
title: #p freq=noraman PBEPBE/SDD
converged: YES YES NO NO
title: Mulliken charges:
elementType: O C C C C C C C C C C C H H H H H H H H H H H H H H
charge: -0.455037 0.343702 -0.542885 0.338526 -0.304458 -0.683419 -0.397427 -0.401064 -0.408517 -0.233191 -0.238892 -0.245431 0.205193 0.208001 0.245404 0.226386 0.213698 0.237637 0.249954 0.223752 0.201014 0.199449 0.225256 0.223272 0.228242 0.340838
chargesum: 0.00000
title: Mulliken charges with hydrogens summed into heavy atoms:
elementType: O C C C C C C C C C C C
charge: -0.114199 0.343702 -0.129692 0.338526 -0.059054 -0.005699 -0.147473 -0.177312 -0.008055 -0.007935 -0.015620 -0.017189
polarizability: 1.78317993e+02 -4.50498978e+00 1.18342944e+02 -3.21761815e+00 -1.33714762e+01 7.69204561e+01
1716.lowfreq: -12.1180 0.0004 0.0006 0.0008 3.5658 11.5674 29.5979 41.8521 65.4711
frequency: 29.5296 41.7045 65.4234 97.1692 103.6800 204.0261 228.3781 236.9016 263.4925 292.1428 336.1924 377.5496 404.7081 477.1781 487.8245 588.2559 616.1806 624.7033 699.3612 721.0397 766.3277 787.5135 849.1609 865.2361 902.5527 922.4099 946.5226 965.1208 974.8176 988.0831 993.4090 1020.7908 1030.7376 1068.5720 1074.6124 1097.4002 1113.7079 1172.8168 1183.2959 1195.2773 1217.3416 1247.6748 1280.0779 1309.8095 1316.3310 1346.0953 1373.9371 1388.9800 1397.6728 1435.0816 1466.2781 1473.2112 1480.3658 1484.3388 1495.5182 1581.0694 1609.3142 1664.0277 2919.4072 2983.1805 2985.7843 2998.3886 3047.3229 3079.6038 3089.6226 3116.9838 3120.8624 3127.2765 3140.4179 3148.2516 3163.5407 3553.8013
redmass: 3.8623 3.5615 2.4446 3.4316 4.5160 1.0798 1.7558 3.0000 1.6152 2.6218 4.3777 2.8218 2.8475 3.2700 3.6106 3.5667 5.8733 3.2156 1.7699 3.1745 1.7195 1.3353 1.2533 1.4355 2.2178 1.4933 4.7838 1.9431 1.4181 4.9602 1.3585 2.5877 2.1066 1.8807 1.7684 1.5771 2.0635 1.0513 1.0969 1.1168 1.3390 1.2935 1.8550 1.3519 1.3800 1.5892 4.2425 1.2213 1.5667 2.2841 1.0834 1.0443 1.4592 1.3066 1.1640 5.6881 6.0393 7.3592 1.0632 1.0399 1.0613 1.0963 1.0931 1.0999 1.1004 1.0889 1.0842 1.0871 1.0917 1.0961 1.1015 1.0664
irintensity: 5.6346 0.1700 3.5623 8.5875 1.6446 1.5154 64.9785 6.2884 75.6789 3.6665 1.5053 11.4423 0.2636 11.2506 7.2635 1.4010 1.0114 9.0402 44.7678 6.9519 63.2773 20.1131 0.1005 4.2117 9.1832 0.8563 86.6569 8.2490 0.4153 0.1415 0.1418 1.4859 11.5288 5.5108 4.3330 18.7595 14.1211 0.0179 32.0007 0.3295 17.5175 6.4195 5.8619 3.1145 2.2540 1.1693 0.9076 14.9269 11.7421 6.2251 1.5616 11.1921 16.0769 9.5546 16.1964 2.9253 5.6392 7.7840 68.0747 43.8563 20.3975 51.7274 21.6875 42.8016 45.6321 17.8396 2.1344 1.0794 17.8952 42.8683 22.3996 4.3805
temp: 298.150 k
press: 1.00000 atm
elementType: 8 6 6 6 6 6 6 6 6 6 6 6 1 1 1 1 1 1 1 1 1 1 1 1 1 1
symmnumber: 1
zpe: 573342.5 jmol-1
zpe.correction: 0.218375 hartree
zpe.thermalcorrener: 0.230822 hartree
zpe.thermalcorrenthalpy: 0.231766 hartree
zpe.thermalcorrgfe: 0.178307 hartree
zpe.sumelectzpe: -501.864972 hartree
zpe.sumelectthermal: -501.852525 hartree
zpe.sumelectthermalent: -501.851581 hartree
zpe.sumelectthermalfe: -501.905039 hartree
dipole: 1.0242 1.3064 -1.1905
dipole: 2.0428
quadrupole: -56.6005 -70.1781 -75.6138
quadrupole: 1.9805 -4.3818 -1.8413
quadrupole: 10.8636 -2.7140 -8.1497 1.9805 -4.3818 -1.8413
hfenergy: -502.0833468 hartree
pointgroup: C01 [X(C11H14O1)]
dipole: -0.4329923 0.1098674 0.668114 debye
dipolederiv: -0.4246499 -0.0185759 -0.2725306 -0.0197676 -0.596516 -0.0584525 -0.4609677 -0.138789 -0.6001346 0.2040221 -0.0401341 -0.0432543 -0.0599781 0.1710389 0.1363237 -0.049423 0.1989782 -0.0142619 0.0538056 -0.0281469 0.0109075 -0.0144573 -0.0134287 -0.0408624 -0.0002511 -0.0483215 0.0941578 0.2846114 0.0252095 -0.0154503 0.1010274 -0.0610224 -0.0440863 -0.0702155 -0.067047 -0.0208117 -0.1884616 -0.0186749 -0.0411714 -0.0167072 -0.0798909 0.0755016 -0.0022209 0.0505481 -0.2031303 0.0641028 0.0215352 0.0170237 -0.004179 -0.0075361 0.044637 0.0072526 -0.0064747 0.0340464 -0.1244531 0.0071269 0.0766709 0.0191545 -0.1330466 0.0539986 0.1206741 0.0446865 -0.0221968 -0.1800096 -0.0252711 -0.0284672 -0.0106179 -0.1203476 0.0743208 -0.0507756 0.1020307 0.0197057 0.5764548 0.1520102 0.2295755 0.0678107 0.4305567 0.0291448 0.3052527 0.090856 0.551636 -0.0251373 -0.0142963 -0.044817 -0.0160353 -0.0954872 0.1050291 -0.0766415 0.0941637 0.08563 0.0570736 0.0330173 0.0694255 0.052161 -0.1167248 0.0831618 0.1205567 0.0837746 0.0193602 0.0159737 -0.0175674 -0.0284679 -0.0069698 -0.1551145 0.0371663 -0.0208751 0.0383943 -0.0899346 -0.1832308 -0.0008384 0.1089501 -0.0184017 0.0257359 0.0262207 0.0511942 0.0342404 0.0746895 0.0625163 0.0008607 -0.1419449 -0.0083168 0.0135021 -0.0010936 -0.1070674 -0.0030573 -0.1038445 0.0336555 0.0547023 0.0420241 0.0480615 -0.0209377 -0.0829322 0.126038 -0.0777065 0.0980601 0.0257641 0.0212256 -0.0963596 -0.0223778 0.072191 -0.008742 -0.1025448 0.0504755 -0.0827637 0.0573887 0.0745956 0.049496 0.0678441 -0.1484001 -0.1048487 0.0628732 -0.1229802 0.0024601 -0.1286053 -0.067782 0.0531076 -0.0374884 0.1053058 0.0261997 0.0420536 0.0147541 0.0607388 0.0101152 -0.035956 -0.0970227 -0.0259617 0.1165842 -0.0536148 -0.0766257 -0.0414134 0.0283179 0.0895679 0.0229138 0.0766635 0.0069934 0.092753 -0.0907247 0.0742673 -0.0976519 -0.0503327 -0.0012246 0.0791428 0.0092153 0.1167902 -0.1309612 -0.1069511 0.0167338 -0.0771508 -0.0357962 -0.109753 -0.1146493 0.0095852 -0.1334491 -0.0880405 0.123524 -0.028735 0.0756323 -0.1260895 0.0461667 0.0256784 0.0543867 0.0377038 0.1120884 -0.0959196 0.080234 -0.0997296 -0.0673837 -0.0326831 -0.0454399 -0.0917101 -0.0555046 0.1196977 -0.0759273 -0.1123658 -0.0757272 -0.0028821 -0.1380763 0.0178973 0.0407621 0.0131469 0.1467959 -0.0327677 0.0459709 -0.0310597 0.0955301 -0.0449337 -0.1085834 0.0534024 -0.0804812 0.3612048 -0.0183053 0.105608 0.0085745 0.2552295 unknown
polarizability: 176.7966822|12.1625848|93.1971656|0.0412712|24.17629|103.5875458 unknown
InChI: InChI=1S/C11H14O/c1-2-10(8-9-12)11-6-4-3-5-7-11/h3-8,12H,2,9H2,1H3
charge 0 multiplicity 1
26 atoms
O  -3.770452 -1.343074 -1.334424
C  -0.907119 0.078975 0.344286
C  -1.382517 1.281861 1.155478
C  0.563749 -0.026476 0.069014
C  -1.754738 -0.881731 -0.135881
C  -1.158717 2.629326 0.419856
C  1.04058 -0.589418 -1.150056
C  1.530294 0.438894 1.004483
C  -3.251893 -0.953564 -0.000888
C  2.421817 -0.707373 -1.409763
C  2.913712 0.321286 0.747019
C  3.368765 -0.255448 -0.460536
H  -2.452161 1.177702 1.408972
H  -0.850306 1.311394 2.127314
H  -1.338213 -1.744317 -0.673732
H  -1.717993 2.65123 -0.532559
H  -1.500331 3.477211 1.041673
H  -0.090474 2.783468 0.186539
H  0.318446 -0.908467 -1.90989
H  1.203253 0.879282 1.953077
H  -3.690587 0.012014 0.319634
H  -3.527032 -1.729505 0.749682
H  2.760327 -1.138881 -2.358712
H  3.635822 0.678419 1.49024
H  4.442015 -0.342773 -0.663253
H  -4.727849 -1.585034 -1.249775
