program: Gaussian 09
title: 000222557
version: EM64L-G09RevD.01
frameworkgroup: C1[X(C7H8ClNO2S)]
method: RPBEPBE
basis: SDD
operation: Freq
keyword: #p
keyword: freq=noraman
keyword: PBEPBE/SDD
title: #p freq=noraman PBEPBE/SDD
converged: YES YES NO NO
title: Mulliken charges:
elementType: Cl S O O N C C C C C C C H H H H H H H H
charge: -0.015398 0.936696 -0.545574 -0.507912 -0.712221 0.063855 0.480078 -0.398723 -0.131083 -0.388993 -0.190050 -0.794660 0.304824 0.244982 0.263378 0.238441 0.227905 0.246352 0.346217 0.331884
chargesum: 0.00000
title: Mulliken charges with hydrogens summed into heavy atoms:
elementType: Cl S O O N C C C C C C C
charge: -0.015398 0.936696 -0.545574 -0.507912 -0.034120 0.063855 0.480078 -0.093899 -0.131083 -0.144010 0.073328 -0.081962
polarizability: 1.58469935e+02 8.57578730e+00 1.32216322e+02 1.47022223e+00 -1.28823109e+00 7.45534783e+01
1716.lowfreq: -9.8406 -0.0023 -0.0013 -0.0003 5.0460 7.6591 10.7437 55.8993 96.1906
frequency: -6.5535 55.8927 96.1790 115.6816 128.0730 155.4663 195.7556 223.6400 236.8514 268.5802 300.2869 306.5272 331.1095 360.7627 418.0476 438.0355 447.1045 467.3999 560.1166 612.9994 653.8526 708.6011 776.8672 810.5060 823.8492 829.8872 922.2929 925.0780 969.2552 990.5060 1000.5060 1051.8125 1071.4697 1103.7836 1144.0782 1217.9772 1255.7633 1357.2053 1392.9400 1402.1256 1460.2032 1468.8148 1474.3410 1525.8099 1567.1640 1603.0669 2983.8067 3066.8771 3095.6329 3135.8769 3140.5516 3171.3605 3375.7744 3547.3759
redmass: 1.0167 6.9713 4.7491 4.0565 7.3101 1.8263 6.4047 5.2020 3.2228 3.8888 4.7852 4.5254 6.7523 8.4012 5.9542 4.7312 3.5087 3.5256 4.0710 6.1435 6.8391 3.7495 1.8649 7.7937 1.4768 3.7556 2.1429 2.0056 1.3580 3.1706 1.6555 1.5646 1.5096 2.1911 1.4539 2.1423 1.5159 3.6548 4.2855 1.2221 2.8126 1.0903 1.0661 1.0896 6.3026 6.8039 1.0389 1.0952 1.1001 1.0915 1.0899 1.0959 1.0411 1.1010
irintensity: 0.6697 3.2607 0.4810 7.1247 1.6176 21.2096 2.3610 9.2900 8.8080 1.6788 1.5520 4.6501 3.2530 13.4430 33.1367 71.7869 7.0422 146.0671 0.3102 11.5811 1.8623 2.2945 129.1127 50.8528 28.9611 36.1558 56.1384 27.4497 1.9188 24.2455 1.7761 19.2675 9.2399 41.2623 6.3358 0.3265 6.7051 2.8937 5.4352 14.8344 81.3444 12.7849 14.2179 37.6011 1.4585 4.6681 21.5993 16.2153 14.0086 6.6894 11.8863 4.1396 28.7547 27.0985
temp: 298.150 k
press: 1.00000 atm
elementType: 17 16 8 8 7 6 6 6 6 6 6 6 1 1 1 1 1 1 1 1
symmnumber: 1
zpe: 363326.9 jmol-1
zpe.correction: 0.138384 hartree
zpe.thermalcorrener: 0.150787 hartree
zpe.thermalcorrenthalpy: 0.151731 hartree
zpe.thermalcorrgfe: 0.099564 hartree
zpe.sumelectzpe: -1333.786128 hartree
zpe.sumelectthermal: -1333.773725 hartree
zpe.sumelectthermalent: -1333.772781 hartree
zpe.sumelectthermalfe: -1333.824948 hartree
dipole: -3.7765 1.7658 2.5011
dipole: 4.8616
quadrupole: -69.3091 -87.6081 -90.8259
quadrupole: 2.2522 10.1540 -1.7823
quadrupole: 13.2719 -5.0270 -8.2449 2.2522 10.1540 -1.7823
hfenergy: -1333.924512 hartree
pointgroup: C01 [X(C7H8Cl1N1O2S1)]
dipole: -1.5732386 -0.5247497 -0.9529052 debye
dipolederiv: -0.3810307 0.3211192 0.0654421 0.2452288 -0.3996839 -0.0513357 0.0711697 -0.0686154 -0.0325783 1.8884105 0.3116524 -0.184728 0.2460842 1.3065458 -0.0026433 -0.1218643 -0.009848 1.5549535 -0.6436171 -0.0854303 0.0438814 -0.0629664 -0.6807782 -0.0630106 0.0100021 0.0680226 -0.4908753 -0.7191627 -0.0601882 -0.0851528 -0.0338069 -0.4930639 0.1370442 -0.056572 0.0060796 -0.6445759 -0.7101292 -0.0467004 0.117926 -0.053385 -0.3828801 -0.0861189 0.1644398 -0.0287452 -0.8430174 -0.122696 0.1044983 -0.0183514 -0.0382644 -0.2481283 -0.0048753 -0.0857511 -0.0419205 -0.1376761 0.2731795 -0.3206794 -0.0583495 -0.2003834 0.1347904 0.032789 -0.0786205 0.0741774 -0.0031761 -0.2661507 0.1574392 0.0212718 -0.1803961 -0.1414188 0.0136177 0.008212 -0.0149798 -0.1016103 0.3525415 -0.6727665 -0.0882106 -0.1659571 0.5726214 0.0864828 -0.0591635 0.1132064 -0.032288 0.0629264 0.0663042 0.0004368 0.1194534 -0.0038661 0.0047081 0.0030004 0.0036254 -0.1471701 -0.1883345 0.1968445 0.0274456 0.0059955 -0.0747172 0.0062343 0.0205658 -0.0134788 -0.077787 -0.0671353 0.0964473 0.0286774 0.1007575 -0.0536658 -0.018663 0.107344 -0.0821438 0.03859 0.1702948 -0.0004152 -0.0095735 0.0258703 0.0607361 -0.0130758 -0.0137284 -0.0028352 0.1499012 -0.0928347 -0.0507754 0.0021136 -0.0377549 0.0759622 -0.0045934 -0.0046103 -0.0050499 0.1507636 0.0666418 -0.022602 0.0003197 -0.0259297 -0.0307146 -0.0209151 -0.0015598 -0.0224859 0.1618319 0.0574944 -0.0548858 0.0459823 0.0142338 -0.0634975 0.0789824 -0.0074918 0.0985285 0.0720244 -0.0940904 -0.0163955 -0.0614525 -0.0914066 0.0405595 -0.0554125 -0.0930169 -0.0141561 0.081245 0.0414506 0.0562438 0.021804 0.0617001 0.0749482 -0.0350325 0.061162 -0.0556878 -0.0923 0.1577826 -0.0571056 0.0948937 -0.0018342 0.1356385 -0.0852575 0.0407655 -0.048588 0.2477662 0.2144592 0.0773952 0.035624 0.0727609 0.1706122 0.0810751 0.0357171 0.0448944 0.1459787 unknown
polarizability: 157.0236942|-9.436552|132.8763602|-6.9103629|4.7217173|75.3396808 unknown
InChI: InChI=1S/C7H8ClNO2S/c1-5-2-3-6(8)7(4-5)12(9,10)11/h2-4H,9H2,1H3
charge 0 multiplicity 1
20 atoms
Cl 1.252434 -2.460488 -0.387474
S  1.881896 0.866286 0.026563
O  1.679775 2.48207 0.028545
O  2.757972 0.136864 1.18082
N  2.531578 0.47874 -1.63977
C  0.137026 0.113408 -0.050641
C  -2.255056 0.588034 0.059971
C  -0.910739 1.039365 0.064875
C  -0.098572 -1.262798 -0.189376
C  -2.489862 -0.804145 -0.075862
C  -1.428241 -1.727504 -0.202701
C  -3.399368 1.570907 0.217623
H  -0.661135 2.103303 0.156495
H  -3.51979 -1.178105 -0.087786
H  -1.626426 -2.797172 -0.317785
H  -3.180082 2.53047 -0.281424
H  -4.337488 1.170648 -0.203316
H  -3.583082 1.792372 1.286469
H  3.049464 1.305581 -1.979419
H  3.090196 -0.388535 -1.605409
