program: Gaussian 09
title: 000222568
version: EM64L-G09RevD.01
frameworkgroup: C1[X(C15H9ClO4S)]
method: RPBEPBE
basis: SDD
operation: Freq
keyword: #p
keyword: freq=noraman
keyword: PBEPBE/SDD
title: #p freq=noraman PBEPBE/SDD
converged: YES YES NO NO
title: Mulliken charges:
elementType: Cl S O O O O C C C C C C C C C C C C C C C H H H H H H H H H
charge: -0.184255 0.876862 -0.143951 -0.186416 -0.461542 -0.441029 0.286397 0.257519 -0.415703 0.292405 0.496207 -0.131094 0.259655 -0.188028 -0.395741 -0.386719 -0.360620 -0.359950 -0.777257 -0.219888 -0.221721 0.299426 0.257780 0.293726 0.289697 0.261178 0.286130 0.224045 0.247005 0.245881
chargesum: 0.00000
title: Mulliken charges with hydrogens summed into heavy atoms:
elementType: Cl S O O O O C C C C C C C C C C C C C C C
charge: -0.184255 0.876862 -0.143951 -0.186416 -0.461542 -0.441029 0.286397 0.257519 -0.415703 0.292405 0.496207 -0.131094 0.259655 -0.188028 -0.096315 -0.128938 -0.066894 -0.070252 -0.005904 0.027117 0.024160
polarizability: 3.23377877e+02 -8.00280022e+00 2.47861394e+02 1.27655352e+01 4.38738915e+00 1.19423923e+02
1716.lowfreq: -3.7952 -0.0018 0.0010 0.0016 2.4259 6.3398 32.0087 41.6705 53.9472
frequency: 31.9452 41.6423 53.9425 86.5858 105.1513 118.1944 144.9058 153.1399 157.7718 181.9601 194.8295 230.4445 239.0073 251.0212 263.0811 278.3089 289.0815 329.8246 364.4854 375.4168 399.1715 412.9035 429.6894 434.6312 450.6987 474.2125 504.5356 541.3382 573.4263 633.9060 648.3725 665.7269 698.4042 715.8808 725.8327 738.3350 803.0020 827.4933 830.8760 834.3307 873.2077 914.5669 928.4424 941.2513 967.9084 994.9203 1005.9823 1016.0274 1021.7974 1042.2276 1044.5609 1075.3535 1094.5676 1163.2186 1175.0184 1192.3565 1216.7084 1257.7189 1289.3355 1303.0467 1343.5892 1375.9277 1400.5659 1401.8317 1441.6185 1443.2020 1456.9390 1472.4219 1477.7269 1520.5415 1551.3920 1556.7784 1591.6427 1596.3782 1615.5523 2999.5309 3088.1134 3103.2804 3142.4929 3147.0481 3155.7913 3166.1998 3170.3119 3175.9849
redmass: 11.9939 7.4323 8.8861 8.5267 4.7757 4.9845 9.6990 8.0140 8.1953 2.8094 1.7346 6.3084 16.7345 5.6300 6.8362 4.9348 5.2583 5.3210 11.0130 8.6032 7.7223 5.5420 4.6634 8.2981 4.5507 8.7962 4.5954 4.6184 5.8468 6.5964 5.7337 5.5412 7.4088 2.8751 5.3481 5.8833 1.6130 5.0304 4.4375 4.3999 1.6653 7.5356 1.6787 18.3151 3.0998 1.3956 1.3852 1.3702 2.1159 1.7826 1.7648 4.1989 2.0252 1.3958 1.0958 2.4925 2.6478 1.7932 2.3337 3.4961 4.7200 6.0179 1.2470 7.2046 2.5045 1.3807 2.1377 2.6571 1.0887 6.2888 8.9129 8.4540 7.6453 7.3192 7.8268 1.0367 1.0966 1.1014 1.0866 1.0890 1.0903 1.0951 1.0965 1.1006
irintensity: 1.1001 4.6778 1.1326 2.0320 2.4671 0.9495 0.4284 2.5447 1.1810 1.0768 1.9484 6.1342 1.0006 2.0652 1.3583 0.7127 0.4519 1.7499 22.3958 43.1568 37.4923 19.0244 1.8541 55.9174 8.2325 6.2902 15.3319 2.2546 4.8173 10.3130 2.0267 0.2349 8.3672 51.0814 1.3928 2.8304 30.0765 45.9896 11.1986 16.7314 16.4634 19.9560 0.2752 60.5739 27.1103 2.9846 4.8617 0.2833 23.0980 5.5085 20.2292 9.1828 5.5704 18.3392 8.2280 0.2758 9.9637 9.0711 169.4648 475.5133 9.4128 11.9942 23.6215 0.3746 0.0457 11.0991 14.2211 5.8978 15.8278 76.8090 5.9370 167.0909 22.4943 1.7123 5.5372 5.6841 5.1264 16.2677 3.0899 5.4158 3.7072 1.4561 5.2006 23.1764
temp: 298.150 k
press: 1.00000 atm
elementType: 17 16 8 8 8 8 6 6 6 6 6 6 6 6 6 6 6 6 6 6 6 1 1 1 1 1 1 1 1 1
symmnumber: 1
zpe: 527233.7 jmol-1
zpe.correction: 0.200813 hartree
zpe.thermalcorrener: 0.219450 hartree
zpe.thermalcorrenthalpy: 0.220394 hartree
zpe.thermalcorrgfe: 0.153434 hartree
zpe.sumelectzpe: -1734.408190 hartree
zpe.sumelectthermal: -1734.389553 hartree
zpe.sumelectthermalent: -1734.388609 hartree
zpe.sumelectthermalfe: -1734.455568 hartree
dipole: 4.1751 3.9625 -0.4578
dipole: 5.7743
quadrupole: -124.4953 -131.2820 -142.5361
quadrupole: -28.3713 4.6017 -0.8656
quadrupole: 8.2758 1.4891 -9.7650 -28.3713 4.6017 -0.8656
hfenergy: -1734.6090024 hartree
pointgroup: C01 [X(C15H9Cl1O4S1)]
dipole: -1.3802701 -1.8038365 -0.0444058 debye
polarizability: 323.6287575|3.0315837|245.8821371|-14.9892991|-14.5582371|121.1523004 unknown
InChI: InChI=1S/C15H9O4S.Cl/c1-8-6-7-11-12(15(8)20(18)19)14(17)10-5-3-2-4-9(10)13(11)16;/h2-7H,1H3;
charge 0 multiplicity 1
30 atoms
Cl 3.25618 2.45154 -1.647753
S  2.651286 1.57906 0.532696
O  0.050108 1.997674 -0.81534
O  -2.057239 -2.936869 0.093256
O  4.079205 1.318936 1.249705
O  1.608173 2.496399 1.356954
C  0.472582 -0.240728 -0.035404
C  -0.093696 -1.550115 -0.020744
C  1.881585 -0.143443 0.065662
C  -1.891374 0.744342 -0.131562
C  2.770013 -1.241488 -0.02995
C  -0.427531 0.930993 -0.330151
C  -2.45134 -0.554098 0.046813
C  -1.580528 -1.76068 0.031744
C  0.75569 -2.682248 -0.035609
C  2.146698 -2.525476 -0.087941
C  -2.737144 1.879749 -0.158289
C  -3.851545 -0.701697 0.201173
C  4.281021 -1.165652 -0.100841
C  -4.128303 1.725606 0.010547
C  -4.686062 0.433822 0.190808
H  0.292102 -3.673393 -0.031316
H  2.795686 -3.404508 -0.162236
H  -2.284245 2.864624 -0.308177
H  -4.258176 -1.7106 0.322575
H  4.622901 -0.352898 -0.76369
H  4.724431 -0.961523 0.88889
H  4.679162 -2.122517 -0.476679
H  -4.780268 2.605183 0.001086
H  -5.767569 0.319105 0.317374
