program: Gaussian 09
title: 000222537
version: EM64L-G09RevD.01
frameworkgroup: C1[X(C7H13BrO2)]
method: RPBEPBE
basis: SDD
operation: Freq
keyword: #p
keyword: freq=noraman
keyword: PBEPBE/SDD
title: #p freq=noraman PBEPBE/SDD
converged: NO YES NO NO
title: Mulliken charges:
elementType: Br O O C C C C C C C H H H H H H H H H H H H H
charge: -0.076873 -0.263300 -0.251044 -0.102414 -0.488290 -0.665671 -0.665635 0.253175 -0.227919 -0.670090 0.278996 0.279020 0.238789 0.233961 0.258658 0.233730 0.238779 0.259083 0.230040 0.229760 0.213579 0.231877 0.231790
chargesum: 0.00000
title: Mulliken charges with hydrogens summed into heavy atoms:
elementType: Br O O C C C C C C C
charge: -0.076873 -0.263300 -0.251044 -0.102414 0.069726 0.065737 0.065957 0.253175 0.231881 0.007156
polarizability: 1.31528017e+02 -9.02882669e+00 9.67320912e+01 -5.86272193e-02 4.37767317e-02 7.37607027e+01
1716.lowfreq: -25.7018 -12.5988 -3.9676 -0.0004 -0.0004 0.0002 6.3783 45.2414 84.3209
frequency: -19.3150 43.7501 84.3163 85.2380 148.0360 179.1938 204.9984 239.7604 248.2276 260.3982 271.6342 284.5369 307.3702 367.4334 368.3144 426.8563 536.9016 562.4799 701.0096 784.3348 796.1602 818.3158 895.3470 910.4977 941.8753 995.4417 1015.2278 1024.3220 1091.3318 1113.2025 1134.4927 1141.2943 1149.2926 1248.4843 1250.6891 1287.2759 1315.7286 1355.9766 1377.4157 1392.7904 1399.1222 1433.7162 1459.3286 1460.7493 1462.9180 1472.9939 1477.6195 1482.2112 1485.8937 1631.9931 2986.5398 2990.0789 2998.1262 3012.0726 3015.2283 3069.6895 3071.6506 3084.5447 3088.5669 3094.6031 3106.8016 3111.1475 3111.6277
redmass: 2.5589 3.1764 4.7695 3.7997 2.2407 6.0643 5.0822 1.1652 1.2424 2.2297 2.4323 1.2006 4.4480 3.0507 2.0789 2.9174 3.5050 3.2639 4.9526 3.6338 1.0971 3.7216 1.9321 4.8770 1.3631 1.9334 1.3824 2.4377 1.8244 2.2310 1.4627 1.6203 3.2210 1.1364 2.7342 1.8257 1.6325 1.4221 1.2127 1.1990 1.2619 1.0862 1.0477 1.0510 1.0402 1.0607 1.0596 1.0555 1.0678 8.8384 1.0362 1.0366 1.0359 1.0582 1.0607 1.0996 1.1068 1.0977 1.0975 1.0984 1.1011 1.1003 1.1026
irintensity: 0.0574 0.3991 0.6166 0.3422 9.3746 5.1845 3.8714 0.1193 1.4690 0.3225 6.4248 2.1899 10.8410 9.3323 0.5466 3.8109 30.6287 3.2251 0.6733 14.3574 4.3934 1.1294 3.4607 10.5091 0.0019 26.1671 1.0055 114.3800 298.0580 11.1277 5.1687 4.7634 194.0213 0.0203 8.5567 6.4088 139.7316 5.4522 34.2321 33.0647 20.6157 20.0866 3.0948 2.1269 12.5042 4.7552 24.6490 15.6416 10.3407 156.9741 15.0155 7.2967 19.9287 20.2841 7.5842 1.0833 9.1320 12.3227 6.0555 27.9189 7.4046 33.4939 42.6599
temp: 298.150 k
press: 1.00000 atm
elementType: 35 8 8 6 6 6 6 6 6 6 1 1 1 1 1 1 1 1 1 1 1 1 1
symmnumber: 1
zpe: 495655.8 jmol-1
zpe.correction: 0.188785 hartree
zpe.thermalcorrener: 0.200756 hartree
zpe.thermalcorrenthalpy: 0.201700 hartree
zpe.thermalcorrgfe: 0.149769 hartree
zpe.sumelectzpe: -437.651129 hartree
zpe.sumelectthermal: -437.639159 hartree
zpe.sumelectthermalent: -437.638215 hartree
zpe.sumelectthermalfe: -437.690146 hartree
dipole: -3.2804 0.1380 0.0038
dipole: 3.2833
quadrupole: -65.2352 -75.0108 -68.7119
quadrupole: 5.9190 0.0159 0.0069
quadrupole: 4.4175 -5.3582 0.9407 5.9190 0.0159 0.0069
hfenergy: -437.8399144 hartree
pointgroup: C01 [X(C7H13Br1O2)]
dipole: -1.2755299 -0.0886546 0.1839247 debye
dipolederiv: -0.5714866 -0.0968622 0.2780021 -0.1007991 -0.2462424 0.0915134 0.2915472 0.0920714 -0.4816613 -1.821909 0.0400599 -0.2389187 0.0738074 -0.2983739 0.0767958 -0.3438464 0.0740117 -0.5349805 -0.733943 -0.035486 0.0814679 0.0984169 -0.3530849 0.1749956 -0.3434978 0.1667714 -0.8491813 0.7867226 0.1442327 -0.4150299 0.1458359 0.3269747 -0.134236 -0.4213252 -0.1345727 0.672334 -0.3133786 -0.028715 0.0658957 -0.1068529 0.0036841 0.0879439 0.3005158 0.0914834 -0.2314101 -0.1320779 -0.0559055 0.1034731 0.0137167 -0.1541238 0.0635586 0.0614386 0.111315 -0.1000919 -0.1315545 -0.0170965 0.11773 -0.0497378 -0.0552189 -0.0257744 0.046147 -0.0760276 -0.20009 1.7955243 0.0005467 0.1142973 -0.1328714 0.2816345 -0.2932848 0.5406952 -0.2834434 1.1233653 0.9483068 0.00333 0.0323205 0.0616228 0.3367122 0.0317276 -0.1485319 0.0272833 0.2495445 -0.1175072 0.018475 -0.0748493 0.011414 0.0550934 0.0147579 -0.0522882 0.0152411 0.0023908 0.0468895 0.0259232 0.0086098 0.0498959 -0.0348227 0.0493356 -0.0325384 0.0262544 0.1044311 0.0499884 -0.025422 -0.0052509 -0.0197022 0.0473859 -0.090104 -0.0530584 -0.0688963 0.0197777 -0.0931483 0.0561469 -0.0997823 0.0046241 0.0852492 0.0019374 -0.0914144 0.0109026 0.0731436 0.1088348 -0.0148583 -0.0427207 -0.0195125 -0.0111176 -0.0770283 -0.0215457 -0.1344069 -0.0386926 0.091106 -0.0391852 0.0828504 -0.0955476 0.0591809 0.0538713 0.0943892 0.0415221 0.0195115 0.1064458 0.0448824 -0.0263227 0.0368585 -0.1181777 0.0177491 -0.0086115 0.0760366 0.07019 -0.0935939 0.0056594 -0.1157579 0.0427205 0.0892585 0.0039746 -0.0785233 -0.0036491 0.0694095 0.0900438 -0.0164953 0.0910252 0.0227011 0.0912729 0.0008857 0.1327724 0.0146698 -0.0095498 -0.0477849 0.0359947 -0.0221394 -0.0296504 -0.105724 0.0688673 0.052701 0.058456 0.0470618 -0.0484991 -0.0175715 -0.0334343 -0.0061194 -0.0001611 -0.1024327 0.0641925 -0.0876852 -0.0603078 -0.1452834 -0.0266019 0.0649444 -0.0320955 0.1087957 0.0233929 0.0825642 0.0238988 0.0464128 0.1140218 -0.0327871 0.0038267 0.0119027 -0.1150975 0.0767725 -0.0398386 0.0610402 0.0642469 0.1122827 0.0317357 0.0297631 0.0193723 0.0069028 -0.115219 -0.0319434 -0.1022763 -0.0558542 unknown
polarizability: 128.9824693|5.0323001|76.2788097|-11.7862174|-7.5693119|96.7595317 unknown
InChI: InChI=1S/C7H13BrO2/c1-4-10-6(9)5-7(2,3)8/h4-5H2,1-3H3
charge 0 multiplicity 1
23 atoms
Br 3.376131 0.740483 -1.193379
O  -1.796925 0.386868 -0.436447
O  -0.708999 -0.210602 1.530681
C  1.919959 0.249391 0.243005
C  0.584713 0.464041 -0.503247
C  2.173344 -1.214127 0.628408
C  2.125954 1.222171 1.412111
C  -0.658731 0.167047 0.335986
C  -3.115171 0.145905 0.236964
C  -4.195442 0.434146 -0.799702
H  0.508674 1.506758 -0.862301
H  0.541792 -0.171838 -1.406417
H  3.18187 -1.337658 1.055416
H  2.07819 -1.884628 -0.242224
H  1.426618 -1.508057 1.390095
H  1.993659 2.270218 1.094536
H  3.13563 1.112372 1.840301
H  1.380618 0.989169 2.195958
H  -3.13383 -0.899583 0.593615
H  -3.178803 0.811236 1.116699
H  -5.193268 0.27086 -0.353223
H  -4.13851 1.478494 -1.149843
H  -4.092374 -0.232265 -1.672492
