program: Gaussian 09
title: 000222539
version: EM64L-G09RevD.01
frameworkgroup: C1[X(C12H16O3)]
method: RPBEPBE
basis: SDD
operation: Freq
keyword: #pfreq=noraman
keyword: PBEPBE/SDD
title: #p freq=noraman PBEPBE/SDD
converged: YES YES NO NO
title: Mulliken charges:
elementType: O O O C C C C C C C C C C C C H H H H H H H H H H H H H H H H
charge: -0.288577 -0.265193 -0.259401 -0.407360 -0.511900 -0.310552 0.262632 0.375822 -0.265119 -0.350898 -0.384136 -0.222495 -0.198060 -0.661197 -0.259016 0.213535 0.222697 0.251205 0.274071 0.250945 0.211601 0.223285 0.232990 0.251014 0.246116 0.222315 0.225452 0.216304 0.248285 0.229055 0.226578
chargesum: 0.00000
title: Mulliken charges with hydrogens summed into heavy atoms:
elementType: O O O C C C C C C C C C C C C
charge: -0.288577 -0.265193 -0.259401 0.028872 0.013376 0.151995 0.262632 0.375822 0.191156 -0.099883 -0.138020 -0.000180 0.027391 0.032448 -0.032438
polarizability: 1.58547275e+02 2.15812360e+01 1.18609917e+02 1.75581841e+00 -8.79221880e-01 1.30235646e+02
1716.lowfreq: -7.7528 0.0004 0.0008 0.0009 2.2799 7.0993 14.6798 25.2648 38.0681
frequency: 10.1887 24.5967 37.9599 58.4249 66.3591 101.2197 130.6315 161.4071 197.9266 219.9907 233.8887 262.5393 322.2147 351.2451 394.6336 411.6757 418.8647 486.9758 504.0613 552.0191 580.6295 609.8384 635.6770 692.2833 743.8906 758.6868 783.2482 813.4148 821.3065 832.1956 862.4306 889.1831 919.8858 935.6312 960.7660 981.1713 982.5912 1013.9808 1020.9728 1026.8449 1063.9021 1083.1826 1094.2993 1108.8631 1143.9158 1155.1748 1166.6935 1177.9449 1183.9598 1200.1055 1221.0826 1277.7268 1281.3194 1313.6623 1338.9009 1358.8819 1364.0110 1374.3500 1389.7786 1390.6984 1439.8256 1443.4196 1444.6442 1456.5215 1463.0441 1473.4579 1483.9920 1490.5278 1591.0183 1612.3956 1635.2729 2970.4792 2993.0297 3005.4478 3012.1567 3028.6775 3041.0475 3060.7011 3072.5572 3088.3022 3092.5370 3118.7618 3126.4449 3135.1345 3154.1828 3163.2546 3171.7731
redmass: 4.2089 3.6474 4.2824 4.0688 4.8673 4.9967 3.2457 2.3440 2.3903 1.5150 5.0723 1.9692 3.0563 3.3256 3.1305 2.9761 3.2463 2.9164 2.8549 3.2611 4.5427 6.4173 4.1413 2.0663 2.4274 1.6490 2.5089 1.5998 1.4176 2.0049 2.9916 1.4641 2.5875 2.8778 1.3621 1.2976 5.8270 2.8344 2.1373 2.3692 1.6937 1.5298 2.2338 3.3500 2.3132 1.6867 1.0819 1.1808 1.1846 1.1994 3.4372 1.1187 1.1841 1.3376 1.4532 1.3960 1.4644 1.7135 1.3193 3.1989 1.0991 1.9004 1.2236 1.0920 1.0435 1.7342 1.0512 1.2824 6.4222 6.2239 8.2837 1.0577 1.0361 1.0608 1.0633 1.0594 1.1039 1.0986 1.1021 1.0973 1.1034 1.1059 1.0846 1.0890 1.0927 1.0952 1.1003
irintensity: 0.4807 0.2385 0.8284 0.6127 1.0846 3.2952 1.0359 5.6752 5.7029 7.7212 0.5394 3.5418 17.4534 6.4865 1.1883 0.0919 2.7892 0.8344 12.1008 2.6724 3.9922 0.6074 3.9254 34.6787 11.6737 91.6485 14.2633 3.5018 0.3177 0.4011 8.7049 10.6038 36.0566 56.9901 0.1345 0.6574 0.9181 51.3311 5.5241 36.4468 2.6650 14.5035 66.2543 146.5652 177.4636 25.0872 8.3666 39.6053 2.2084 13.8976 202.9610 2.9469 11.1255 1.0396 37.6802 9.4980 6.5505 8.4797 13.9570 22.2161 46.8043 2.1515 16.9138 11.5062 13.1721 133.2343 12.1921 2.8639 22.5949 78.4366 136.1871 31.5540 17.6201 20.7410 18.5864 33.9560 28.3563 16.4430 21.1621 37.1308 0.4295 33.8534 2.4839 13.1429 32.1046 23.6227 4.5940
temp: 298.150 k
press: 1.00000 atm
elementType: 8 8 8 6 6 6 6 6 6 6 6 6 6 6 6 1 1 1 1 1 1 1 1 1 1 1 1 1 1 1 1
symmnumber: 1
zpe: 671514.8 jmol-1
zpe.correction: 0.255766 hartree
zpe.thermalcorrener: 0.271180 hartree
zpe.thermalcorrenthalpy: 0.272124 hartree
zpe.thermalcorrgfe: 0.209469 hartree
zpe.sumelectzpe: -691.403496 hartree
zpe.sumelectthermal: -691.388083 hartree
zpe.sumelectthermalent: -691.387139 hartree
zpe.sumelectthermalfe: -691.449793 hartree
dipole: -1.2502 0.2233 -0.1773
dipole: 1.2823
quadrupole: -81.3921 -83.8720 -88.5126
quadrupole: -0.3810 3.1051 -0.3920
quadrupole: 3.2001 0.7202 -3.9204 -0.3810 3.1051 -0.3920
hfenergy: -691.6592627 hartree
pointgroup: C01 [X(C12H16O3)]
dipole: -0.4332733 -0.2551573 0.0409823 debye
polarizability: 167.804398|-3.5142152|109.7198169|-0.6793126|-2.9874599|129.868623 unknown
InChI: InChI=1S/C12H16O3/c1-2-14-12(13)9-6-10-15-11-7-4-3-5-8-11/h3-5,7-8H,2,6,9-10H2,1H3
charge 0 multiplicity 1
31 atoms
O  0.644512 1.265529 0.623867
O  -3.23048 -1.529184 0.570096
O  -2.495979 -0.493177 -1.387159
C  -1.63406 1.858666 0.085145
C  -2.241406 0.639218 0.805944
C  -0.248241 1.589519 -0.508578
C  -2.644133 -0.480453 -0.140952
C  1.985665 0.963808 0.338908
C  -3.651785 -2.727847 -0.221798
C  2.540824 0.938875 -0.965685
C  2.796204 0.67353 1.465775
C  3.909612 0.61954 -1.128158
C  4.156999 0.357832 1.286137
C  -2.484332 -3.705034 -0.384252
C  4.724234 0.328208 -0.012433
H  -2.299862 2.181988 -0.736802
H  -1.554847 2.695081 0.803823
H  -3.136839 0.92896 1.387088
H  -1.519469 0.233078 1.538669
H  -0.281243 0.742793 -1.220318
H  0.133729 2.489919 -1.031045
H  -4.471475 -3.157082 0.376272
H  -4.030453 -2.386552 -1.201313
H  1.928864 1.159071 -1.845226
H  2.341631 0.702335 2.461129
H  4.336065 0.599792 -2.13769
H  4.777513 0.134436 2.161361
H  -2.833256 -4.621065 -0.896411
H  -1.67943 -3.257571 -0.991115
H  -2.072883 -3.994059 0.598116
H  5.782521 0.082344 -0.148892
