program: Gaussian 09
title: 000222536
version: EM64L-G09RevD.01
frameworkgroup: C1[X(C6H10O4)]
method: RPBEPBE
basis: SDD
operation: Freq
keyword: #pfreq=noraman
keyword: PBEPBE/SDD
title: #p freq=noraman PBEPBE/SDD
converged: YES YES NO NO
title: Mulliken charges:
elementType: O O O O C C C C C C H H H H H H H H H H
charge: -0.250838 -0.262780 -0.229448 -0.237177 0.066225 -0.690313 0.312361 0.313657 -0.752185 -0.749243 0.269772 0.230449 0.234987 0.240481 0.253630 0.250147 0.247485 0.248075 0.259252 0.245461
chargesum: 0.00000
title: Mulliken charges with hydrogens summed into heavy atoms:
elementType: O O O O C C C C C C
charge: -0.250838 -0.262780 -0.229448 -0.237177 0.335998 0.015604 0.312361 0.313657 -0.000923 0.003546
polarizability: 8.91824519e+01 2.85321285e+00 7.85835450e+01 -5.09433086e+00 -4.58165778e-01 6.63509358e+01
1716.lowfreq: -14.2333 -2.7460 -0.0006 -0.0004 0.0005 9.6861 24.0310 55.3506 58.6096
frequency: 23.8570 55.3074 58.5970 78.3857 80.8648 130.8439 161.6879 199.1444 229.7603 291.7169 321.0439 425.7788 444.0866 483.7377 556.5342 567.8096 596.3925 633.8962 787.1287 799.9844 889.2681 903.5601 983.7655 997.0606 1041.7946 1042.9630 1059.7386 1077.9924 1153.4011 1181.5344 1207.9309 1323.3665 1344.8811 1383.1530 1384.2599 1397.8277 1452.2442 1452.6216 1453.6266 1454.4714 1461.8315 1464.6065 1661.7822 1671.0117 3007.1039 3007.2230 3007.8501 3053.4174 3097.6157 3100.2972 3109.6016 3118.4368 3142.3019 3144.0594
redmass: 5.9530 2.3221 1.3876 1.4089 1.9801 3.8963 4.0608 1.4472 2.1473 3.3627 3.9328 4.0355 3.2285 3.4153 3.3822 3.2546 4.7389 4.9358 4.0781 2.8497 7.1916 4.8988 2.0342 1.7317 1.6565 1.6681 2.3639 1.8178 2.4206 2.7978 3.6928 1.2782 1.3004 1.2458 1.2445 1.2909 1.0558 1.0550 1.0516 1.0535 1.0428 1.0472 9.6987 9.9636 1.0376 1.0359 1.0374 1.0873 1.0960 1.0948 1.0998 1.1007 1.1022 1.1015
irintensity: 0.2882 3.6245 1.8385 0.3890 1.7355 5.6972 3.5179 2.5011 4.7640 0.5782 3.1545 13.9538 15.8317 0.2570 6.1237 4.5352 0.7361 6.3018 21.8798 22.2735 245.3542 58.9683 87.8069 28.9708 11.2013 12.4220 79.5440 198.8953 30.1709 209.2464 260.5531 3.0317 2.0024 58.7171 57.2284 24.0989 33.6574 19.7109 18.9849 16.5273 14.0469 7.6111 83.8922 275.6681 3.0042 6.9048 1.4143 5.6625 6.8864 7.0913 18.6637 13.6002 9.1214 8.5995
temp: 298.150 k
press: 1.00000 atm
elementType: 8 8 8 8 6 6 6 6 6 6 1 1 1 1 1 1 1 1 1 1
symmnumber: 1
zpe: 407682.3 jmol-1
zpe.correction: 0.155278 hartree
zpe.thermalcorrener: 0.167456 hartree
zpe.thermalcorrenthalpy: 0.168400 hartree
zpe.thermalcorrgfe: 0.115124 hartree
zpe.sumelectzpe: -534.754105 hartree
zpe.sumelectthermal: -534.741927 hartree
zpe.sumelectthermalent: -534.740983 hartree
zpe.sumelectthermalfe: -534.794259 hartree
dipole: 1.4972 0.9372 -2.5135
dipole: 3.0721
quadrupole: -51.7079 -55.7313 -63.1918
quadrupole: 0.9758 4.6104 5.0272
quadrupole: 5.1691 1.1457 -6.3148 0.9758 4.6104 5.0272
hfenergy: -534.9093829 hartree
pointgroup: C01 [X(C6H10O4)]
dipole: 0.5306926 -0.3659286 1.0223953 debye
dipolederiv: -1.2904756 -0.4637492 0.0831306 -0.6943144 -1.0151576 0.2067387 0.0531176 0.1446976 -0.3511471 -1.2427751 0.5026279 -0.1929819 0.7776087 -0.9268727 0.1037834 -0.1406551 0.0296851 -0.5217068 -0.5865465 0.1271436 -0.2055238 -0.1949119 -0.6963205 0.2418066 0.0052855 0.3304755 -0.5426299 -0.5891221 0.1690423 -0.1195845 0.0811035 -0.4715722 -0.207548 -0.3914825 0.0062923 -0.8386759 1.411611 0.1256148 -0.0974313 -0.1738843 0.9244274 -0.0071253 -0.231469 0.2465689 0.3291319 -0.1076621 -0.0404287 0.0108291 -0.0348604 -0.1916953 0.0279999 0.0528474 0.0296074 0.0481388 1.2880549 0.2453103 0.2650559 0.8035779 1.226268 -0.4612147 -0.0097355 -0.5681739 0.6457992 1.1772008 -0.710869 0.3314778 -0.7178849 0.9574536 0.1879489 0.7245514 -0.0649341 1.1082486 -0.3557114 -0.0579216 -0.1469892 -0.0570375 -0.0164797 0.0076903 -0.2377522 0.0006409 -0.0940924 -0.0437152 0.0851239 0.0255389 0.1795627 -0.2805642 -0.1859679 0.0583658 -0.1784452 -0.1095939 0.0081824 -0.0455666 0.0046154 0.0251495 0.0166807 0.0650493 0.0467074 -0.0419792 -0.022982 0.0302917 0.1028258 0.0710046 0.1046522 -0.0166784 -0.0479933 0.0717801 -0.0546321 0.056286 -0.0880475 -0.0646882 -0.0496981 -0.0385066 0.082109 0.0089296 -0.0594738 0.0020174 0.0871042 0.1218415 -0.0001444 -0.0258885 -0.018156 0.0858269 -0.0129424 -0.0083182 0.0483746 -0.0930817 0.0864856 0.0101863 0.0403001 -0.0163164 0.1235579 -0.0425787 0.0170361 -0.044155 -0.047123 0.0633691 0.0485579 -0.0095307 0.0856088 -0.0368222 -0.0222518 0.0269322 -0.0195194 0.138359 0.0268529 -0.0580553 0.0141511 -0.0894545 0.0156373 0.0731587 0.0530089 0.0805322 0.07391 0.1143699 0.036584 0.0154817 -0.0077246 0.0971318 0.0793125 0.0240765 0.0412991 -0.0559133 0.0311188 -0.0911847 0.0270903 -0.0653216 0.0230271 -0.009839 0.0222271 0.0112124 0.1194468 -0.0553232 0.0795911 -0.0410475 0.0511098 0.1000434 -0.0049566 -0.0770496 0.0004357 0.0705214 unknown
polarizability: 88.2947137|-3.5479996|79.1231804|5.6003664|-1.8486668|66.6990385 unknown
InChI: InChI=1S/C6H10O4/c1-4(7)9-6(3)10-5(2)8/h6H,1-3H3
charge 0 multiplicity 1
20 atoms
O  1.292815 -0.84069 0.303605
O  -0.922261 -0.106979 0.623362
O  1.336396 1.128016 -0.962008
O  -2.228599 0.269294 -1.281018
C  -0.091142 -1.0799 -0.127762
C  -0.454318 -2.49949 0.264919
C  1.906867 0.340006 -0.181899
C  -1.915583 0.577563 -0.112821
C  3.294298 0.4733 0.399183
C  -2.501986 1.692096 0.719792
H  -0.201477 -0.862996 -1.205443
H  0.220794 -3.215234 -0.234101
H  -1.490557 -2.714451 -0.045283
H  -0.369331 -2.628521 1.356348
H  3.221378 0.726377 1.472243
H  3.840191 -0.481453 0.323196
H  3.841698 1.270467 -0.12391
H  -2.591595 1.388818 1.77497
H  -1.82499 2.564883 0.676807
H  -3.481998 1.984993 0.315424
