program: Gaussian 09
title: 000222540
version: EM64L-G09RevD.01
frameworkgroup: C1[X(C12H22O2)]
method: RPBEPBE
basis: SDD
operation: Freq
keyword: #pfreq=noraman
keyword: PBEPBE/SDD
title: #p freq=noraman PBEPBE/SDD
converged: YES YES NO NO
title: Mulliken charges:
elementType: O O C C C C C C C C C C C C H H H H H H H H H H H H H H H H H H H H H H
charge: -0.420018 -0.229380 0.004757 -0.025694 -0.469826 -0.470926 -0.408296 -0.411679 -0.380152 -0.464338 -0.425339 -0.524421 -0.719454 0.169103 0.191764 0.195184 0.188817 0.203824 0.206342 0.198162 0.196154 0.190652 0.189266 0.197138 0.198839 0.187749 0.235215 0.232114 0.196609 0.211530 0.265570 0.266648 0.217948 0.215091 0.215551 0.375498
chargesum: 0.00000
title: Mulliken charges with hydrogens summed into heavy atoms:
elementType: O O C C C C C C C C C C C C
charge: -0.044519 -0.229380 0.196520 0.169490 -0.077184 -0.066422 -0.021490 -0.025276 0.006435 0.002991 -0.017200 0.007797 -0.070865 0.169103
polarizability: 1.50010686e+02 -2.37742582e-01 1.30324005e+02 -2.24339654e+00 -3.93926078e-03 1.15015552e+02
1716.lowfreq: -2.7163 -0.0004 0.0004 0.0005 9.1088 13.7420 26.1821 36.8954 51.3611
frequency: 14.3016 36.7277 50.7282 68.3332 103.2208 128.4465 139.3854 172.1222 205.7525 218.9389 232.9843 295.0817 306.7798 321.1672 378.2968 419.0649 425.9510 435.4526 459.5855 504.1014 532.8305 550.4844 601.5826 637.3948 750.4468 776.1241 782.6713 792.6968 826.5842 852.6420 869.5300 888.3327 894.7373 918.3309 933.2024 966.8510 991.0750 1022.9804 1040.7087 1048.8437 1058.1354 1061.5410 1074.0586 1085.6882 1110.0841 1118.4267 1137.4426 1151.8600 1181.1527 1203.8089 1214.2833 1240.5357 1251.5595 1258.3253 1261.4653 1268.9839 1287.0106 1304.1313 1308.6476 1311.8146 1329.1909 1335.5005 1339.1036 1340.2360 1341.0883 1346.5682 1363.2894 1380.8605 1389.8903 1441.0437 1457.9455 1461.0358 1462.3425 1467.5270 1472.2469 1476.5417 1477.5310 1485.6365 1499.8718 1668.6995 2922.4944 2938.0841 2952.1789 2959.6536 2961.0157 2963.4354 2965.0694 2970.4108 2974.5550 2996.0721 3016.8082 3022.2031 3024.0887 3027.8467 3028.5026 3035.2251 3038.3171 3041.8017 3065.1895 3067.8465 3074.7646 3510.6078
redmass: 11.0077 4.0214 3.1503 2.7964 2.2214 2.4500 3.2229 2.4922 2.7379 1.5969 1.8150 2.1025 3.1139 1.9755 2.3423 2.4918 3.0565 3.5501 2.0553 1.7848 3.1106 1.9369 3.4273 1.3282 1.4199 1.5479 1.5067 1.8816 2.1597 1.9457 3.2790 1.9518 1.4412 2.1808 2.1490 2.1395 1.6136 2.1269 2.2517 1.8841 1.4730 1.6149 1.4595 2.0844 1.9962 2.3179 1.9633 2.2498 1.4185 1.4198 1.4636 1.4323 1.3667 1.2814 1.2476 1.3125 1.1113 1.3394 1.3599 1.2697 1.4090 1.3826 1.5679 1.4870 1.4826 1.4854 1.4569 1.6488 1.2151 1.0877 1.0869 1.0872 1.0880 1.0781 1.0750 1.0555 1.0682 1.0824 1.0688 8.0443 1.0794 1.0816 1.0651 1.0666 1.0613 1.0597 1.0650 1.0636 1.0372 1.0606 1.0649 1.0953 1.0957 1.0973 1.0978 1.0977 1.0966 1.0996 1.1006 1.0994 1.0992 1.0639
irintensity: 1.0206 0.0025 0.0479 0.0758 0.3643 0.4508 1.2198 0.5936 0.9429 0.0760 0.1753 0.3233 0.0484 0.0560 0.5439 3.5535 2.6739 16.4200 2.8591 28.9231 7.9259 0.7039 23.0915 120.5272 16.7124 14.9954 0.4293 0.7561 5.1749 5.8308 1.0496 1.9713 10.6512 3.1375 12.1351 21.7650 12.8921 58.8017 4.0834 140.4713 1.1024 41.7192 0.1695 17.4285 0.2711 0.5250 4.1174 3.8160 1.3123 0.7277 1.9071 1.8354 3.4371 1.8554 4.8151 4.8533 1.5592 12.8722 10.9344 9.8091 5.3771 8.7270 1.1867 12.1568 1.3686 3.3131 0.3202 34.8963 13.4243 26.9915 3.3185 3.5327 10.9733 20.1204 2.5319 6.5708 2.5053 19.3325 13.9318 207.9666 1.0067 19.5121 25.2722 26.9066 38.6849 40.6988 36.4600 56.8640 28.7063 8.0871 20.9593 90.3425 88.8229 7.1915 13.9851 58.8910 3.6495 103.5355 60.3605 42.7813 58.9293 18.6852
temp: 298.150 k
press: 1.00000 atm
elementType: 8 8 6 6 6 6 6 6 6 6 6 6 6 6 1 1 1 1 1 1 1 1 1 1 1 1 1 1 1 1 1 1 1 1 1 1
symmnumber: 1
zpe: 840829.7 jmol-1
zpe.correction: 0.320255 hartree
zpe.thermalcorrener: 0.335776 hartree
zpe.thermalcorrenthalpy: 0.336720 hartree
zpe.thermalcorrgfe: 0.275734 hartree
zpe.sumelectzpe: -619.796289 hartree
zpe.sumelectthermal: -619.780768 hartree
zpe.sumelectthermalent: -619.779824 hartree
zpe.sumelectthermalfe: -619.840810 hartree
dipole: -1.1003 0.3375 1.2524
dipole: 1.7009
quadrupole: -88.6586 -85.7149 -91.8068
quadrupole: -1.2335 6.7772 -1.8189
quadrupole: 0.0682 3.0118 -3.0800 -1.2335 6.7772 -1.8189
hfenergy: -620.116544 hartree
pointgroup: C01 [X(C12H22O2)]
dipole: 0.4258202 0.134856 -0.4982965 debye
polarizability: 149.9394151|0.2444328|130.3235621|-2.7423875|0.0688199|115.0872655 unknown
InChI: InChI=1S/C12H22O2/c1-2-10(8-9-12(13)14)11-6-4-3-5-7-11/h10-11,13H,2-9H2,1H3
charge 0 multiplicity 1
36 atoms
O  -3.802459 -1.569078 -1.212554
O  -3.731169 -1.147275 1.068201
C  1.199609 0.191729 -0.113635
C  0.074757 1.10056 0.495509
C  2.559643 0.94261 -0.197821
C  1.397062 -1.129703 0.681445
C  3.697046 0.065353 -0.773111
C  2.532021 -2.009857 0.104805
C  3.869937 -1.240824 0.034037
C  -1.235543 0.32845 0.823278
C  -0.197029 2.349303 -0.39766
C  -1.923344 -0.2959 -0.407527
C  -1.275292 3.314213 0.144958
C  -3.209245 -1.018427 -0.060673
H  0.904157 -0.079397 -1.153313
H  0.460987 1.475387 1.470841
H  2.839046 1.277071 0.824833
H  2.462719 1.854462 -0.815796
H  0.46043 -1.718332 0.696555
H  1.629311 -0.878165 1.738702
H  4.643846 0.640182 -0.785848
H  3.463747 -0.188527 -1.828424
H  2.251464 -2.341531 -0.917103
H  2.644078 -2.925667 0.717555
H  4.657107 -1.874671 -0.41872
H  4.205656 -0.993924 1.062731
H  -1.031959 -0.465605 1.563653
H  -1.94745 1.011551 1.321085
H  -0.474541 2.02072 -1.421198
H  0.74396 2.919285 -0.509989
H  -1.261849 -1.020136 -0.921005
H  -2.169194 0.469381 -1.168804
H  -2.284644 2.864327 0.136833
H  -1.319125 4.234248 -0.466751
H  -1.051007 3.613564 1.186601
H  -4.643034 -2.035382 -0.95189
