program: Gaussian 09
title: 000222636
version: EM64L-G09RevD.01
frameworkgroup: C1[X(C21H28Cl2O3)]
method: RPBEPBE
basis: SDD
operation: Freq
keyword: #p
keyword: freq=noraman
keyword: PBEPBE/SDD
title: #p freq=noraman PBEPBE/SDD
converged: NO YES NO NO
title: Mulliken charges:
elementType: Cl Cl O O O C C C C C C C C C C C C C C C C C C C C C H H H H H H H H H H H H H H H H H H H H H H H H H H H H
charge: -0.019333 -0.043890 -0.263236 -0.240267 -0.283574 0.414881 -0.263706 -0.194849 -0.565284 0.070927 -0.448179 -0.537167 -0.812962 -0.799129 -0.530140 -0.344408 0.265733 -0.502998 -0.410205 -0.273466 0.455855 -0.277363 -0.323226 -0.208728 -0.199599 -0.105662 0.230214 0.234289 0.214613 0.227271 0.218025 0.206949 0.201978 0.222357 0.213524 0.213979 0.232764 0.215003 0.225246 0.210181 0.229646 0.226133 0.242894 0.239908 0.233584 0.232427 0.241923 0.250549 0.227977 0.205214 0.231409 0.260872 0.290164 0.260883
chargesum: 0.00000
title: Mulliken charges with hydrogens summed into heavy atoms:
elementType: Cl Cl O O O C C C C C C C C C C C C C C C C C C C C C
charge: -0.019333 -0.043890 -0.263236 -0.240267 -0.283574 0.414881 -0.033492 0.039440 -0.123400 0.288952 -0.039252 -0.101286 -0.151217 -0.134055 -0.061113 0.129084 0.265733 -0.028648 0.068321 0.163156 0.455855 -0.277363 -0.062355 0.081436 0.061284 -0.105662
polarizability: 2.75687943e+02 3.38895514e+01 2.43620755e+02 -1.82327048e+01 1.38666937e+01 2.10463398e+02
1716.lowfreq: -17.1561 -15.7290 -6.2101 -0.0014 -0.0007 -0.0004 3.3623 12.1050 14.7274
frequency: -12.5988 7.6464 12.4368 16.5581 31.4429 38.3270 39.2296 63.2645 91.6734 100.2087 130.5782 138.7711 150.1608 161.6229 167.0435 177.8131 189.1398 205.8684 207.4357 219.6472 231.9843 244.5465 266.6385 299.9086 314.5436 322.6056 366.7529 369.8019 376.2883 397.9903 407.9324 420.3420 433.6588 438.7817 452.3221 459.6350 478.2208 487.4664 537.4418 557.9801 565.1391 596.5969 635.1837 654.5749 672.8175 684.7924 709.3434 747.8494 773.3785 780.1708 794.9282 809.3126 818.6771 825.9755 845.9141 861.1636 871.2309 878.0806 880.1743 884.4516 918.9227 931.8993 943.1063 944.3318 949.2959 952.0912 964.9171 987.6896 993.3000 1011.8727 1024.4442 1025.0757 1049.5268 1062.6106 1069.0852 1075.0468 1077.3530 1084.4850 1094.5585 1113.2541 1128.8766 1129.0121 1148.5819 1154.5180 1181.1279 1192.2038 1201.0889 1203.8265 1213.1020 1215.0525 1224.3695 1230.9952 1235.3965 1236.7120 1243.8740 1266.6628 1280.0737 1284.9862 1299.3449 1300.9697 1318.4968 1319.3934 1331.9102 1332.5091 1345.8722 1351.6776 1354.9140 1365.6011 1372.3353 1376.6126 1387.8677 1392.6977 1449.0386 1451.9038 1452.9565 1454.7275 1459.3745 1464.5330 1467.1216 1470.6153 1477.9810 1479.0947 1481.0467 1495.1048 1504.0682 1564.0715 1583.8502 1639.5102 2964.3803 2965.0399 2966.3937 2967.5758 2969.9396 2980.8439 2983.6960 3001.9664 3013.3408 3014.6535 3020.8570 3021.1715 3026.4853 3030.0903 3035.7825 3036.5556 3042.8614 3044.7725 3054.8748 3072.9183 3079.6765 3083.2876 3093.1614 3093.4878 3107.4729 3160.9652 3177.0194 3182.6831
redmass: 3.6347 5.3354 7.3001 7.3885 7.1565 5.7031 5.0168 5.6282 4.5265 2.5232 3.5829 2.9656 3.2410 1.2434 4.9928 11.8392 1.5113 2.3772 3.2403 2.9516 5.5396 8.9151 2.2966 2.6172 1.9631 3.7128 4.5201 3.2004 2.9287 4.1484 2.4744 2.0839 3.2078 4.6141 3.9238 2.9815 2.8681 5.9358 3.1321 3.8354 2.8662 3.8587 7.5253 2.4940 3.4116 4.9263 4.3353 2.2885 2.1054 1.9217 2.6602 2.1523 2.3008 1.8808 2.6122 1.3837 2.5491 2.0503 2.2141 2.2900 1.9862 1.5648 1.8739 1.9248 1.7113 2.5858 1.9926 2.0575 1.4680 2.8906 2.1316 2.4752 1.7172 1.8037 1.6883 2.2683 1.6303 1.5777 2.5385 1.7359 1.8436 1.7484 2.0907 1.7320 1.3043 1.5311 1.5298 1.7517 2.9070 2.1564 1.4343 1.4930 1.3684 1.5647 1.2781 1.8446 1.1790 1.3803 2.0066 1.2442 1.3498 1.3022 1.4000 1.3570 4.8816 1.4188 1.4808 1.3077 2.9698 1.2360 1.7412 1.2064 1.9204 1.2311 1.1331 1.1031 1.0625 1.0668 1.0873 1.0705 1.0766 1.0905 1.0710 1.0755 1.0642 8.6976 7.0662 9.1383 1.0635 1.0409 1.0559 1.0628 1.0374 1.0766 1.0663 1.0853 1.0601 1.0799 1.0904 1.0635 1.0805 1.0799 1.0917 1.0884 1.1004 1.0985 1.0977 1.0988 1.1039 1.0955 1.1025 1.1028 1.1069 1.0888 1.0934 1.0973
irintensity: 0.0495 0.3041 0.1501 0.1556 0.6399 0.4034 0.2597 1.2110 0.9720 2.1746 1.6588 0.4994 0.9867 0.3439 0.2383 1.1438 0.6448 0.7687 1.3368 1.1309 4.8096 2.5443 0.3297 3.1967 0.6780 9.9732 4.5345 0.2005 1.7288 4.7749 2.3702 0.4785 0.9314 0.5965 7.4009 3.5840 1.6852 8.1724 0.4664 12.8006 0.3212 8.9295 17.4661 2.7146 18.1791 23.4837 20.2505 11.1283 3.7295 1.5891 8.8874 6.7346 4.3992 34.5189 1.1669 28.0482 3.8009 16.3261 1.7945 2.1153 0.6700 1.9588 15.6148 36.3283 2.6950 58.4593 4.6754 0.2126 0.5052 57.6613 21.4131 34.4039 4.7008 36.5150 2.2000 39.7212 2.8236 1.9781 2.4086 1.9062 81.7656 82.9572 2.9597 2.2410 51.3800 6.8011 3.5708 1.7281 101.3653 0.4679 34.9973 12.1920 23.8763 7.7916 13.3147 5.7117 4.0842 0.4203 1.5111 0.7637 1.9241 1.0020 34.7987 4.1233 4.3313 0.9473 0.7566 2.5425 18.5500 12.3465 18.6377 9.1234 184.7637 17.6879 30.4377 17.5526 0.8346 0.6566 7.1269 4.2646 2.7738 15.4260 14.3842 14.4260 4.4457 8.0356 4.6721 152.7027 9.0139 25.4451 48.8855 22.0615 40.6894 31.0886 49.5249 42.2282 16.0112 56.5217 27.3757 22.4721 17.4877 32.6073 43.9460 15.1789 85.1490 14.5037 67.3730 36.6499 10.6600 34.4956 43.5757 24.1594 15.4495 1.8305 0.4338 1.8446
temp: 298.150 k
press: 1.00000 atm
elementType: 17 17 8 8 8 6 6 6 6 6 6 6 6 6 6 6 6 6 6 6 6 6 6 6 6 6 1 1 1 1 1 1 1 1 1 1 1 1 1 1 1 1 1 1 1 1 1 1 1 1 1 1 1 1
symmnumber: 1
zpe: 1168057.4 jmol-1
zpe.correction: 0.444890 hartree
zpe.thermalcorrener: 0.471036 hartree
zpe.thermalcorrenthalpy: 0.471980 hartree
zpe.thermalcorrgfe: 0.384412 hartree
zpe.sumelectzpe: -1960.799110 hartree
zpe.sumelectthermal: -1960.772964 hartree
zpe.sumelectthermalent: -1960.772020 hartree
zpe.sumelectthermalfe: -1960.859588 hartree
dipole: -1.0959 1.2482 -3.0558
dipole: 3.4781
quadrupole: -172.0411 -173.3918 -168.1204
quadrupole: -5.0279 -0.1494 12.2128
quadrupole: -0.8566 -2.2074 3.0640 -5.0279 -0.1494 12.2128
hfenergy: -1961.2439998 hartree
pointgroup: C01 [X(C21H28Cl2O3)]
dipole: 0.5332671 -0.4189571 -1.1885165 debye
polarizability: 263.8704628|37.3462201|254.2937488|21.7020345|-9.8470151|211.6078839 unknown
InChI: InChI=1S/C21H28Cl2O3/c1-21(2)15-6-5-14(17(21)12-15)9-11-26-20(24)4-3-10-25-19-8-7-16(22)13-18(19)23/h7-8,13-15,17H,3-6,9-12H2,1-2H3
charge 0 multiplicity 1
54 atoms
Cl -1.46433 1.207945 2.168208
Cl -5.521848 -1.894509 0.006763
O  3.259138 1.724541 -0.388373
O  2.715865 3.173721 1.361917
O  -1.706685 2.761466 -0.531192
C  0.292803 -2.817136 -0.248637
C  1.128787 -1.992709 0.818963
C  1.509644 -3.835479 -0.215129
C  1.795114 -3.350661 1.252905
C  2.184113 -1.085878 0.129324
C  2.654918 -3.351676 -1.134747
C  3.2071 -1.960385 -0.675893
C  -0.088977 -2.148327 -1.582628
C  -0.98642 -3.429054 0.369019
C  2.899762 -0.19256 1.174245
C  3.918231 0.795486 0.588965
C  2.675121 2.877105 0.145398
C  1.983006 3.692476 -0.937419
C  0.461762 3.828291 -0.662249
C  -0.258587 2.481543 -0.753523
C  -2.540756 1.641157 -0.393834
C  -2.57317 0.8362 0.774747
C  -3.458053 1.348799 -1.432431
C  -3.471947 -0.239618 0.908759
C  -4.375471 0.282129 -1.322314
C  -4.360241 -0.50158 -0.152519
H  0.548216 -1.430574 1.574359
H  1.270299 -4.901582 -0.380146
H  2.849334 -3.323108 1.578514
H  1.208765 -3.894627 2.01028
H  1.652866 -0.411644 -0.571795
H  3.481605 -4.08893 -1.116131
H  2.296593 -3.310958 -2.181146
H  3.589247 -1.397649 -1.548331
H  4.08408 -2.138635 -0.021823
H  -0.570175 -2.883885 -2.256048
H  0.770547 -1.717685 -2.123638
H  -0.819218 -1.333129 -1.409177
H  -0.801538 -3.913853 1.343629
H  -1.417053 -4.191567 -0.30837
H  -1.75472 -2.647356 0.522388
H  3.443217 -0.837492 1.897004
H  2.152641 0.376874 1.760894
H  4.382456 1.403125 1.385675
H  4.692864 0.295981 -0.014121
H  2.173358 3.234432 -1.92269
H  2.430522 4.703355 -0.933585
H  0.30294 4.256914 0.342985
H  0.019043 4.524348 -1.397627
H  -0.140612 2.019674 -1.755478
H  0.105638 1.775238 0.016236
H  -3.441621 1.98348 -2.323565
H  -3.485104 -0.843755 1.819362
H  -5.08057 0.065024 -2.128986
