program: Gaussian 09
title: 000222514
version: EM64L-G09RevD.01
frameworkgroup: C1[X(C14H16O)]
method: RPBEPBE
basis: SDD
operation: Freq
keyword: #pfreq=noraman
keyword: PBEPBE/SDD
title: #p freq=noraman PBEPBE/SDD
converged: YES YES NO NO
title: Mulliken charges:
elementType: O C C C C C C C C C C C C C C H H H H H H H H H H H H H H H H
charge: -0.436286 -0.028077 -0.607483 0.452088 0.154759 -0.689643 -0.710000 0.444373 -0.611351 -0.619438 -0.362830 0.299664 -0.441376 -0.281518 -0.246101 0.200734 0.214783 0.214238 0.233271 0.202328 0.208683 0.215850 0.233432 0.200471 0.225025 0.260488 0.228302 0.239711 0.225485 0.227115 0.353303
chargesum: 0.00000
title: Mulliken charges with hydrogens summed into heavy atoms:
elementType: O C C C C C C C C C C C C C C
charge: -0.082983 0.172657 -0.178462 0.452088 0.154759 -0.045362 -0.060247 0.444373 -0.386326 -0.358950 -0.134528 0.299664 -0.201666 -0.056033 -0.018986
polarizability: 1.90095324e+02 2.16388380e+01 1.91211904e+02 1.72938452e+01 -5.85034880e+00 9.01685298e+01
1716.lowfreq: -14.4851 -3.0165 0.0005 0.0007 0.0007 11.9297 48.5017 73.5232 91.0623
frequency: 48.1676 73.4936 91.0026 120.6687 176.8632 216.5673 230.1138 240.1641 249.3403 283.5937 302.5492 323.3031 365.0607 386.3660 419.8599 432.5741 464.3524 476.6754 518.5899 536.0352 546.1976 625.4171 636.5968 680.2111 732.2182 759.6710 772.0019 794.3134 853.4746 858.3478 867.1520 884.4374 897.4381 921.0064 947.3572 960.3560 964.1447 973.3664 987.5111 1020.0011 1033.5190 1093.4551 1107.9938 1131.6926 1152.5515 1177.0676 1184.6443 1189.3730 1223.2788 1238.2924 1257.9229 1270.4538 1295.5878 1330.0348 1349.2956 1377.3105 1380.1440 1398.3687 1406.7324 1422.5760 1438.2504 1462.8454 1465.9577 1473.7057 1476.9977 1487.0956 1490.3157 1518.9183 1589.3006 1616.3199 1641.2411 2956.4672 2969.9291 2976.5403 2988.7905 3040.7219 3061.8351 3068.0490 3073.1245 3080.3785 3101.9967 3121.7477 3133.7879 3151.3860 3158.9379 3166.7646 3582.2825
redmass: 3.0591 3.5820 3.2399 4.6627 3.7909 1.1954 3.1841 2.6142 1.1217 4.5058 4.3747 1.1062 2.1452 2.0439 4.4418 3.4475 3.4437 4.2107 3.2023 3.8927 4.2665 3.8021 4.1518 3.1418 4.2190 1.3985 3.0942 2.4622 1.4373 1.5959 3.5999 1.6628 1.8138 1.2272 2.3963 1.4370 1.5183 3.2478 1.3326 3.5249 2.1493 1.5580 1.7839 1.7197 1.2920 1.1082 2.0755 1.3047 1.3574 1.4696 1.9313 1.4491 2.6344 1.5150 1.3795 1.7728 1.3328 1.2196 4.0800 4.7803 2.7090 2.8493 1.0564 1.0591 1.0760 1.0697 1.0880 3.6050 7.4627 5.6224 6.4052 1.0805 1.0362 1.0368 1.0633 1.0995 1.0991 1.0990 1.0994 1.0992 1.0906 1.0854 1.0892 1.0947 1.0925 1.0983 1.0660
irintensity: 0.0106 0.0183 0.0363 1.2054 3.1334 0.3630 0.0656 0.5737 0.3941 6.8080 1.1234 136.5002 0.1808 1.0762 0.9009 8.4629 6.4220 1.6571 3.4413 3.1646 2.8205 8.9668 8.3316 5.0275 1.6083 53.0160 2.3246 21.8447 6.9184 28.9384 11.8236 0.4138 25.4163 4.3782 10.2475 4.8203 3.2312 34.3198 0.3146 0.8795 3.0082 8.8642 10.4524 78.5476 128.5708 2.3730 8.1047 14.5196 23.4452 11.2665 15.2765 17.4204 41.4611 0.7450 5.3584 21.7608 8.5225 14.4308 16.4043 16.3181 21.8251 0.4726 3.1291 1.2790 7.7701 18.9083 21.9283 32.6399 32.9091 9.9904 85.2926 28.1187 34.0081 27.5698 51.4944 15.7906 28.1175 49.8682 42.4546 64.5784 18.9469 1.1778 8.6212 37.1619 8.5470 26.5316 43.5882
temp: 298.150 k
press: 1.00000 atm
elementType: 8 6 6 6 6 6 6 6 6 6 6 6 6 6 6 1 1 1 1 1 1 1 1 1 1 1 1 1 1 1 1
symmnumber: 1
zpe: 681575.6 jmol-1
zpe.correction: 0.259598 hartree
zpe.thermalcorrener: 0.273438 hartree
zpe.thermalcorrenthalpy: 0.274382 hartree
zpe.thermalcorrgfe: 0.219656 hartree
zpe.sumelectzpe: -617.230253 hartree
zpe.sumelectthermal: -617.216414 hartree
zpe.sumelectthermalent: -617.215470 hartree
zpe.sumelectthermalfe: -617.270196 hartree
dipole: 2.1685 -0.6151 0.5875
dipole: 2.3294
quadrupole: -81.1753 -85.7492 -93.8325
quadrupole: 6.5353 4.0153 0.5104
quadrupole: 5.7437 1.1698 -6.9135 6.5353 4.0153 0.5104
hfenergy: -617.4898517 hartree
pointgroup: C01 [X(C14H16O1)]
dipole: -0.8277161 0.3298139 0.2144426 debye
polarizability: 195.3351714|21.1648902|186.5755739|-14.1601092|8.5611339|89.5650117 unknown
InChI: InChI=1S/C14H16O/c1-10(2)7-12-9-13(15)8-11-5-3-4-6-14(11)12/h3-6,8-10,15H,7H2,1-2H3
charge 0 multiplicity 1
31 atoms
O  -0.336499 -3.748119 -0.199114
C  -2.812994 1.398757 -0.038865
C  -1.864825 0.82792 1.074669
C  -0.74748 -0.095376 0.600186
C  0.596456 0.37392 0.326928
C  -2.074007 2.286316 -1.066937
C  -3.618522 0.290476 -0.757786
C  1.596219 -0.579101 -0.131299
C  -1.030624 -1.458603 0.433257
C  1.253753 -1.955014 -0.308209
C  1.001153 1.741063 0.502116
C  -0.041621 -2.382323 -0.02504
C  2.931873 -0.121831 -0.397216
C  2.309293 2.15519 0.241817
C  3.285299 1.215033 -0.215944
H  -3.5417 2.040968 0.501211
H  -2.500904 0.269877 1.789656
H  -1.446917 1.682502 1.638232
H  -1.307785 1.708828 -1.615327
H  -1.568613 3.141169 -0.581084
H  -2.787287 2.693752 -1.807704
H  -4.353531 0.73782 -1.452393
H  -2.954707 -0.367201 -1.348045
H  -4.175084 -0.339278 -0.037184
H  -2.039809 -1.826363 0.665651
H  2.000597 -2.67619 -0.654107
H  0.271063 2.47755 0.850184
H  3.674776 -0.850022 -0.743616
H  2.592258 3.2034 0.38806
H  4.308724 1.548965 -0.419721
H  -1.279156 -3.935885 0.034624
