program: Gaussian 09
title: 000222493
version: EM64L-G09RevD.01
frameworkgroup: C1[X(C10H13ClO2S)]
method: RPBEPBE
basis: SDD
operation: Freq
keyword: #p
keyword: freq=noraman
keyword: PBEPBE/SDD
title: #p freq=noraman PBEPBE/SDD
converged: NO YES NO NO
title: Mulliken charges:
elementType: Cl S O O C C C C C C C C C C H H H H H H H H H H H H H
charge: 0.101505 0.782567 -0.441599 -0.531517 0.129130 0.502329 -0.743994 -0.690571 -0.692683 -0.395085 -0.370159 -0.193232 -0.238647 -0.239615 0.222764 0.219353 0.216921 0.227820 0.213702 0.217282 0.214631 0.224566 0.217312 0.260121 0.241559 0.254228 0.291311
chargesum: 0.00000
title: Mulliken charges with hydrogens summed into heavy atoms:
elementType: Cl S O O C C C C C C C C C C
charge: 0.101505 0.782567 -0.441599 -0.531517 0.129130 0.502329 -0.084956 -0.031767 -0.036173 -0.134964 -0.128600 0.060996 0.052664 -0.239615
polarizability: 2.57891047e+02 7.36813360e+00 1.37424130e+02 -3.33062396e+00 9.73834689e+00 9.97411717e+01
1716.lowfreq: -0.0021 0.0014 0.0026 1.2111 4.8537 7.5466 27.3213 39.5315 52.1945
frequency: 27.2901 39.4846 52.0626 75.6418 95.9767 134.6876 159.8227 188.9542 213.9924 223.2009 244.3906 253.8206 273.8796 308.3074 323.7804 338.8197 373.7418 395.8829 404.9392 425.3929 461.3537 482.3471 551.0305 562.1886 600.5060 623.1663 715.4468 738.4332 830.2638 836.8313 856.9732 876.0167 920.7917 933.1472 946.1247 965.7800 991.6542 994.3458 1021.1000 1024.3916 1052.1710 1106.0028 1120.0175 1193.9407 1202.5393 1215.3515 1271.6827 1298.2172 1368.8972 1378.3578 1379.7077 1401.5969 1407.3862 1460.6511 1463.0775 1465.2637 1473.2203 1482.5152 1488.4621 1498.5869 1574.9341 1590.2748 2975.4685 2977.5053 2981.5819 3071.3036 3073.2558 3074.0594 3080.6695 3082.0031 3084.2061 3132.8923 3146.5250 3151.2191 3178.1470
redmass: 4.7689 7.1620 3.6585 8.7125 6.3122 6.2647 11.7822 1.4219 3.7321 2.2911 2.7097 1.3359 7.1090 1.0541 2.7287 2.9270 3.9658 3.2497 2.9006 5.2661 3.2318 7.4468 2.8487 3.6951 16.3818 7.1533 5.7968 3.3037 2.6006 1.3877 1.4324 17.8756 1.7343 1.6482 1.2010 1.3527 1.3881 4.3222 1.4243 1.3935 2.9816 2.2447 1.3839 1.1487 2.9448 2.5961 3.1145 1.2793 3.4878 1.1825 1.4134 3.4601 1.2016 1.0516 1.3109 1.0536 1.3592 1.1421 1.0521 1.0816 7.1603 5.9389 1.0353 1.0346 1.0358 1.1005 1.1000 1.1000 1.0995 1.0990 1.0994 1.0874 1.0898 1.0963 1.0938
irintensity: 0.1338 0.2111 0.3033 1.2442 0.9109 3.2720 1.1714 0.3282 0.6830 1.4039 3.6181 2.0185 8.4855 0.0378 5.2142 0.3679 1.7807 0.8783 0.6716 22.0681 4.4749 25.8233 27.5201 20.6872 46.3389 0.3002 1.7584 1.4496 10.6002 19.2508 24.4476 56.3536 4.3171 2.5047 0.2040 0.0470 0.9018 0.5197 1.9527 0.4188 78.5825 23.3998 9.4204 3.6709 5.2575 2.1300 28.4621 1.1380 0.5664 18.1898 19.6593 20.3721 8.5288 0.1524 3.0814 0.8378 8.7050 10.5446 13.5694 26.7258 0.9178 82.7983 28.0625 29.7120 29.2971 14.3670 7.4972 5.3166 49.9874 92.9000 44.9209 7.3035 0.8733 15.0347 9.2627
temp: 298.150 k
press: 1.00000 atm
elementType: 17 16 8 8 6 6 6 6 6 6 6 6 6 6 1 1 1 1 1 1 1 1 1 1 1 1 1
symmnumber: 1
zpe: 540638.2 jmol-1
zpe.correction: 0.205918 hartree
zpe.thermalcorrener: 0.221829 hartree
zpe.thermalcorrenthalpy: 0.222773 hartree
zpe.thermalcorrgfe: 0.161335 hartree
zpe.sumelectzpe: -1396.228427 hartree
zpe.sumelectthermal: -1396.212517 hartree
zpe.sumelectthermalent: -1396.211573 hartree
zpe.sumelectthermalfe: -1396.273010 hartree
dipole: 5.5317 -1.0660 -2.0299
dipole: 5.9880
quadrupole: -96.8532 -101.1460 -95.9778
quadrupole: 3.2425 6.8072 3.0301
quadrupole: 1.1391 -3.1537 2.0145 3.2425 6.8072 3.0301
hfenergy: -1396.4343454 hartree
pointgroup: C01 [X(C10H13Cl1O2S1)]
dipole: -2.2013769 -0.0141269 -0.8389115 debye
polarizability: 255.6981005|18.2522198|131.022452|-0.5914818|-18.8399526|108.3357963 unknown
InChI: InChI=1S/C10H13ClO2S/c1-10(2,3)8-4-6-9(7-5-8)14(12)13-11/h4-7H,1-3H3
charge 0 multiplicity 1
27 atoms
Cl 4.972943 1.879196 0.034743
S  3.080775 -0.638449 -0.518528
O  3.231903 1.25209 0.079351
O  3.463954 -1.651881 0.705784
C  -3.080237 0.11615 0.134809
C  -1.554822 -0.040679 -0.054386
C  -3.719574 1.037495 -0.935338
C  -3.358202 0.729986 1.541546
C  -3.755533 -1.286744 0.041603
C  -0.844423 0.607685 -1.099578
C  -0.814462 -0.86072 0.847545
C  0.551209 0.450618 -1.248141
C  0.574592 -1.033945 0.718061
C  1.236274 -0.373341 -0.33497
H  -4.806757 1.112357 -0.753276
H  -3.305431 2.062042 -0.897898
H  -3.580429 0.639701 -1.957703
H  -2.891933 1.727335 1.63717
H  -4.447609 0.840609 1.695323
H  -2.965594 0.092908 2.353889
H  -4.846979 -1.1889 0.189151
H  -3.580219 -1.746027 -0.948304
H  -3.37212 -1.98034 0.810856
H  -1.374367 1.250167 -1.807201
H  -1.331008 -1.371737 1.6669
H  1.086163 0.971067 -2.049405
H  1.152587 -1.660044 1.407597
