program: Gaussian 09
title: 000222489
version: EM64L-G09RevD.01
frameworkgroup: C1[X(C6H10O4S)]
method: RPBEPBE
basis: SDD
operation: Freq
keyword: #p
keyword: freq=noraman
keyword: PBEPBE/SDD
title: #p freq=noraman PBEPBE/SDD
converged: YES YES NO NO
title: Mulliken charges:
elementType: S O O O O C C C C C C H H H H H H H H H H
charge: 0.182533 -0.421643 -0.408283 -0.227668 -0.236247 -0.515934 -0.477309 -0.586093 0.276498 0.201214 -0.654787 0.310814 0.287881 0.276323 0.290245 0.253513 0.227979 0.233279 0.225211 0.381629 0.380845
chargesum: 0.00000
title: Mulliken charges with hydrogens summed into heavy atoms:
elementType: S O O O O C C C C C C
charge: 0.182533 -0.040013 -0.027438 -0.227668 -0.236247 -0.205119 0.086895 -0.042336 0.276498 0.201214 0.031682
polarizability: 1.26046991e+02 -3.86588307e+00 8.51991989e+01 8.66374368e+00 6.92639584e+00 7.70329515e+01
1716.lowfreq: -0.0017 -0.0011 0.0011 3.5055 6.0334 10.6573 40.1619 42.8046 61.2821
frequency: 40.0685 42.8017 61.1411 76.5976 80.1875 103.9883 153.7449 196.5118 231.2372 236.6310 254.8141 321.2175 357.8084 487.0158 509.7612 554.9719 571.7513 600.1523 624.4241 640.5916 661.4989 763.5783 790.3444 798.6449 876.2432 983.9541 995.2092 1033.7702 1040.7156 1054.8792 1067.3102 1119.0869 1165.9262 1198.3382 1237.8043 1247.3427 1269.3246 1282.3069 1343.0862 1374.3414 1397.5947 1427.4052 1466.5962 1470.2877 1483.6989 1659.9310 1664.2110 2986.5973 3021.9890 3022.5013 3070.9125 3078.3631 3084.3223 3085.7730 3110.3343 3516.5929 3518.3045
redmass: 4.3536 10.3113 3.3486 3.7518 7.6461 3.0928 5.5420 5.3045 4.9256 1.1523 3.8457 4.9875 6.0786 2.0868 2.9994 2.3075 4.2985 2.3501 4.1199 1.5129 2.7857 6.3514 1.3425 2.3420 3.8356 2.4658 1.8130 3.1436 1.2482 2.4208 2.1581 1.9351 1.1686 1.3210 1.2718 1.3744 1.6543 1.2473 2.0129 1.9936 1.2040 1.0871 1.0868 1.0392 1.0484 8.3767 8.5752 1.0355 1.0587 1.0609 1.0899 1.1005 1.0996 1.0957 1.1066 1.0640 1.0640
irintensity: 0.3003 2.0985 0.8657 0.6598 2.4464 2.1943 1.7906 0.7329 3.0142 0.2740 2.7573 0.5428 0.5049 21.7765 76.6234 32.5165 48.1054 64.8387 14.3603 109.7244 80.0592 9.7611 2.4349 11.0429 0.8980 12.4191 18.7433 63.2143 3.3144 449.5765 4.6628 6.9777 2.8337 7.8549 0.4788 3.7367 4.9898 19.2160 92.7957 50.6334 17.8680 42.1460 6.2356 15.0726 8.8020 304.4861 139.9226 30.5811 16.5307 8.8015 1.0482 17.8780 12.2717 3.8740 28.4628 30.8483 27.0840
temp: 298.150 k
press: 1.00000 atm
elementType: 16 8 8 8 8 6 6 6 6 6 6 1 1 1 1 1 1 1 1 1 1
symmnumber: 1
zpe: 415789.3 jmol-1
zpe.correction: 0.158366 hartree
zpe.thermalcorrener: 0.171507 hartree
zpe.thermalcorrenthalpy: 0.172451 hartree
zpe.thermalcorrgfe: 0.116856 hartree
zpe.sumelectzpe: -932.737483 hartree
zpe.sumelectthermal: -932.724342 hartree
zpe.sumelectthermalent: -932.723398 hartree
zpe.sumelectthermalfe: -932.778993 hartree
dipole: 1.5022 -0.6654 1.5194
dipole: 2.2378
quadrupole: -60.7841 -68.9427 -78.8863
quadrupole: 5.9126 1.5229 -0.9156
quadrupole: 8.7536 0.5950 -9.3485 5.9126 1.5229 -0.9156
hfenergy: -932.8958491 hartree
pointgroup: C01 [X(C6H10O4S1)]
dipole: -0.5823227 0.2352835 0.6169916 debye
dipolederiv: -0.2791409 -0.0185153 0.0876165 0.0058658 -0.20964 -0.1154084 0.1050747 -0.1015007 -0.0879468 -0.6043902 -0.298805 0.2152398 -0.2790524 -0.7333025 0.3557286 0.1538103 0.341019 -0.5256367 -1.1038493 -0.4562702 0.3039025 -0.4162577 -0.5774286 0.0690216 0.2544072 0.0606032 -0.4186115 -0.606703 -0.043962 0.2485354 0.179908 -0.6494753 -0.2123914 0.4463572 -0.1266243 -0.6701976 -0.7243815 0.0233098 -0.1355099 -0.1725394 -0.6235116 0.2798275 0.0374595 0.331291 -0.6296739 0.2151477 0.0596744 0.109932 0.0212011 -0.1397967 0.0154295 0.1040351 -0.0012144 0.0404461 -0.236603 0.0288798 -0.0738178 0.2785999 -0.019385 0.1285547 -0.2761719 0.0708769 -0.0305543 0.3144974 0.0597059 -0.1852983 0.106843 0.0713847 0.0401216 -0.272044 0.0656267 0.2043558 0.731914 0.23389 -0.5851708 -0.0792652 1.3130834 0.0247429 -0.7005043 0.0154972 0.834268 1.5604623 0.3134697 -0.0039411 0.3795825 0.8224069 -0.5226359 -0.0465959 -0.5391744 0.7396273 -0.1292699 0.0311636 -0.016075 -0.0520054 0.0742451 0.0140736 0.1583502 -0.0169417 0.0166607 0.0381216 0.0102826 0.0104235 -0.0029229 0.0507791 0.0126182 -0.0007406 -0.0026686 -0.0386781 0.0817219 0.0049938 -0.0042869 0.0011195 0.1434814 -0.0303277 0.0383497 0.013291 0.0081407 0.0940136 0.0201635 -0.0184532 -0.0254283 -0.0269586 -0.0425888 -0.0013832 -0.0398697 0.1088942 0.0207829 0.0003513 0.024105 -0.0171598 -0.0643727 0.0440949 0.0592965 0.0308529 0.0386051 -0.0447481 -0.0278814 -0.0301269 -0.0452939 0.0502423 -0.0547181 0.0160079 -0.056841 -0.1429498 0.1023446 -0.0174012 -0.0030017 0.0648266 -0.1421406 0.0195355 -0.0450749 0.0336357 0.1023287 0.0937089 -0.0122497 -0.0310427 -0.0208883 0.0493704 -0.0918249 -0.1097831 -0.0838871 -0.0724466 -0.1034764 -0.0200162 0.1119658 -0.0344771 0.0981767 0.0564169 0.1184124 0.0510894 -0.0071733 0.3313594 0.0545263 0.060395 0.014853 0.2083066 -0.0943528 0.0784983 -0.1451298 0.2665906 0.2484882 0.0546903 -0.0853911 0.0924913 0.3045351 0.1040824 -0.1177612 0.1000687 0.2639514 unknown
polarizability: 125.7849882|-3.8568346|85.9845391|-9.4366825|-6.3248075|76.5096138 unknown
InChI: InChI=1S/C6H10O4S/c1-2-11-4(6(9)10)3-5(7)8/h4,7,9H,2-3H2,1H3
charge 0 multiplicity 1
21 atoms
S  -1.666853 0.879805 -0.652259
O  -0.783377 -2.185392 0.297665
O  3.506016 1.234388 -0.239216
O  0.708013 -1.736361 -1.427787
O  2.530925 -0.341155 1.161736
C  -0.063456 0.100527 0.041457
C  1.129649 0.941053 -0.427856
C  -2.899392 0.307602 0.681229
C  0.031144 -1.330941 -0.458683
C  2.415324 0.515259 0.257888
C  -4.316049 0.712544 0.250724
H  -0.152209 0.100615 1.139661
H  1.270389 0.8498 -1.519771
H  0.952896 2.010393 -0.211872
H  -2.791693 -0.784746 0.775441
H  -2.609611 0.788649 1.63139
H  -4.4075 1.806597 0.127589
H  -4.596557 0.231992 -0.703054
H  -5.044245 0.396288 1.020226
H  -0.71523 -3.107689 -0.070575
H  4.336418 0.938374 0.223666
