program: Gaussian 09
title: 000222488
version: EM64L-G09RevD.01
frameworkgroup: C1[X(C12H17ClO2S)]
method: RPBEPBE
basis: SDD
operation: Freq
keyword: #p
keyword: freq=noraman
keyword: PBEPBE/SDD
title: #p freq=noraman PBEPBE/SDD
converged: YES YES NO NO
title: Mulliken charges:
elementType: Cl S O O C C C C C C C C C C C C H H H H H H H H H H H H H H H H H
charge: -0.216434 0.850507 -0.456674 -0.466698 -0.242517 0.685734 -0.243817 0.594707 -0.420706 -0.406942 -0.379833 -0.490715 -0.686671 -0.685807 -0.686326 -0.685675 0.252257 0.214579 0.301140 0.246506 0.244210 0.202936 0.224687 0.243326 0.239854 0.225614 0.205841 0.219403 0.220187 0.228996 0.227351 0.220673 0.220309
chargesum: 0.00000
title: Mulliken charges with hydrogens summed into heavy atoms:
elementType: Cl S O O C C C C C C C C C C C C
charge: -0.216434 0.850507 -0.456674 -0.466698 0.009740 0.685734 -0.029238 0.594707 -0.420706 -0.105803 -0.133327 -0.246505 -0.015722 -0.014498 -0.017740 -0.017342
polarizability: 2.21501093e+02 9.52928203e-01 1.77742301e+02 5.55523373e+00 9.03118977e-01 1.40576300e+02
1716.lowfreq: -10.5797 -6.3709 -5.4478 -0.0021 0.0020 0.0022 21.9930 30.2484 38.4774
frequency: 21.7341 30.0567 38.1653 69.2770 76.0141 112.4367 126.0404 148.2223 166.7166 184.5480 209.7466 211.2951 220.2615 230.5862 237.0635 239.1420 246.6288 265.8037 296.6170 317.3394 359.8761 388.5048 416.2306 430.5629 441.7515 475.6011 479.6815 568.4881 624.8164 649.8234 672.8552 737.9058 789.1021 827.9433 854.0754 888.7099 893.7634 902.8687 920.5026 923.6291 951.0577 957.0246 961.0373 978.4401 989.9574 1057.4708 1065.7054 1111.3875 1114.1472 1119.3748 1150.2368 1171.4162 1210.9702 1217.1958 1262.9798 1291.6683 1296.6437 1306.5349 1351.6361 1381.7970 1382.5184 1386.5817 1400.7474 1401.4588 1404.1039 1464.6728 1466.5701 1468.5806 1470.8558 1471.7894 1479.7197 1481.1906 1487.3808 1493.4337 1541.6913 1607.6508 2979.4644 2979.7130 2981.3388 2981.7335 2985.4201 3040.8364 3073.1416 3073.6474 3080.5080 3081.5972 3083.4935 3085.5618 3087.9652 3091.5898 3127.6506 3149.3760 3152.3649
redmass: 2.9990 3.8657 4.5519 3.1124 8.3119 4.9557 4.0010 3.8219 8.8497 3.7291 1.2926 1.6409 1.3997 5.5305 2.5476 1.9244 1.1786 3.0322 3.7859 2.5210 3.3432 7.7604 9.8228 3.9022 3.1771 3.8108 3.4750 2.7894 3.3909 7.4482 2.9611 3.3982 4.4250 16.2075 1.4186 2.6178 2.6956 1.4654 1.1847 1.1977 10.3510 1.4339 1.4801 1.4003 3.2298 1.6311 1.5728 2.5420 2.6159 1.7837 2.0679 1.5427 1.5614 2.6261 1.5510 1.3322 2.2007 1.3332 1.4754 1.1860 1.1929 2.9652 1.2269 1.4024 1.6131 1.0496 1.0471 1.0520 1.0750 1.6564 1.0801 1.0521 1.0541 1.3508 5.8158 7.1367 1.0351 1.0354 1.0355 1.0359 1.0844 1.0852 1.0998 1.0999 1.0992 1.1007 1.0978 1.1001 1.1006 1.1001 1.0877 1.0922 1.0948
irintensity: 0.1225 0.1475 0.1814 0.2439 0.8981 1.9933 1.1627 1.3889 1.1900 1.6695 0.3318 0.9348 0.9070 0.3423 2.2326 0.5371 0.0347 7.5284 0.6586 0.2290 7.5722 33.8416 84.8330 17.1937 0.6376 29.5125 18.0633 1.1868 6.7169 0.5055 3.2267 1.7178 3.6826 55.8749 23.9625 6.4991 0.1548 11.6893 3.6695 1.5596 62.9326 0.0710 2.3905 0.2598 6.7429 8.2113 36.7400 0.9456 1.1339 17.5428 1.1714 0.5932 17.1559 2.8015 0.9623 1.4704 17.2421 0.3811 2.4547 20.1836 17.2282 28.4137 5.6576 0.9002 12.0767 4.3340 0.0053 6.0911 4.1570 6.7732 10.0811 26.1707 1.4709 58.6549 1.4892 3.9066 22.4752 24.6416 38.9306 16.6429 16.2892 1.5690 1.0680 3.6871 86.8582 22.1303 55.7372 36.6830 13.3911 29.2427 9.4610 1.1240 20.0535
temp: 298.150 k
press: 1.00000 atm
elementType: 17 16 8 8 6 6 6 6 6 6 6 6 6 6 6 6 1 1 1 1 1 1 1 1 1 1 1 1 1 1 1 1 1
symmnumber: 1
zpe: 688363.6 jmol-1
zpe.correction: 0.262184 hartree
zpe.thermalcorrener: 0.281117 hartree
zpe.thermalcorrenthalpy: 0.282061 hartree
zpe.thermalcorrgfe: 0.213701 hartree
zpe.sumelectzpe: -1474.671362 hartree
zpe.sumelectthermal: -1474.652429 hartree
zpe.sumelectthermalent: -1474.651485 hartree
zpe.sumelectthermalfe: -1474.719845 hartree
dipole: -4.5571 5.5319 0.6092
dipole: 7.1931
quadrupole: -105.3307 -114.8114 -118.0665
quadrupole: 6.8842 0.2215 -0.3315
quadrupole: 7.4055 -2.0752 -5.3303 6.8842 0.2215 -0.3315
hfenergy: -1474.933546 hartree
pointgroup: C01 [X(C12H17Cl1O2S1)]
dipole: -1.5880869 2.3419138 -0.0465921 debye
polarizability: 220.5509258|-2.3501378|177.702664|9.757573|-3.0453467|141.5661039 unknown
InChI: InChI=1S/C12H17O2S.Cl/c1-8(2)10-5-6-11(9(3)4)12(7-10)15(13)14;/h5-9H,1-4H3;
charge 0 multiplicity 1
33 atoms
Cl 2.312652 -2.100229 1.908042
S  1.281454 -1.978298 -0.297129
O  2.486895 -1.848333 -1.370007
O  0.248348 -3.21835 -0.415624
C  2.453244 1.10738 -0.014138
C  0.937622 0.882118 -0.02496
C  -3.479773 0.368239 0.066438
C  -1.960377 0.543266 0.033014
C  0.283275 -0.365907 -0.105207
C  -1.104518 -0.580061 -0.065656
C  0.045151 1.986294 0.067758
C  -1.354603 1.824108 0.095489
C  2.894937 1.813165 1.295132
C  2.897776 1.900256 -1.272598
C  -3.928615 -0.483311 1.283703
C  -4.00811 -0.238505 -1.261033
H  2.968909 0.132576 -0.049016
H  -3.924166 1.377767 0.177631
H  -1.503677 -1.598189 -0.117911
H  0.471801 2.993403 0.127881
H  -1.995221 2.710599 0.173456
H  2.450059 2.820996 1.390588
H  3.993832 1.928133 1.301988
H  2.60735 1.218718 2.179933
H  2.628831 1.361391 -2.198002
H  3.994358 2.034614 -1.261232
H  2.433454 2.903436 -1.306446
H  -3.53382 -1.514206 1.218537
H  -5.031295 -0.549217 1.319131
H  -3.576927 -0.044968 2.234683
H  -3.723757 0.381786 -2.129832
H  -5.110355 -0.315783 -1.236019
H  -3.603333 -1.254891 -1.422294
