program: Gaussian 09
title: 000222502
version: EM64L-G09RevD.01
frameworkgroup: C1[X(C16H25Cl2NO)]
method: RPBEPBE
basis: SDD
operation: Freq
keyword: #p
keyword: freq=noraman
keyword: PBEPBE/SDD
title: #p freq=noraman PBEPBE/SDD
converged: YES YES NO NO
title: Mulliken charges:
elementType: Cl Cl O N C C C C C C C C C C C C C C C C H H H H H H H H H H H H H H H H H H H H H H H H H
charge: -0.022490 -0.016236 -0.479384 -0.192575 -0.339289 -0.367725 -0.430214 -0.373060 -0.359568 -0.196461 -0.324439 -0.330389 0.489457 -0.693722 -0.689432 -0.381731 -0.428168 -0.060063 -0.204456 -0.110715 0.204544 0.203231 0.209335 0.203650 0.213671 0.242832 0.194911 0.191959 0.194171 0.203387 0.202977 0.202737 0.195708 0.200070 0.189462 0.222169 0.208329 0.205995 0.218015 0.217742 0.204908 0.371733 0.314455 0.239109 0.255564
chargesum: 0.00000
title: Mulliken charges with hydrogens summed into heavy atoms:
elementType: Cl Cl O N C C C C C C C C C C C C C C C C
charge: -0.022490 -0.016236 -0.107651 -0.192575 0.068486 0.045259 0.026289 0.013810 0.037990 0.006516 0.074006 0.059142 0.489457 -0.057229 -0.048767 -0.067277 -0.189059 -0.060063 0.051108 -0.110715
polarizability: 2.69676595e+02 1.10590782e+01 1.98704018e+02 -5.05647270e+00 1.96052140e+01 1.50206363e+02
1716.lowfreq: -4.5410 -0.0005 0.0017 0.0018 2.4375 7.4779 15.5741 17.6549 27.6305
frequency: 15.3887 17.0085 27.5435 37.5959 43.4588 49.5207 65.1480 79.1326 86.4910 110.2595 122.4765 151.3145 172.0479 180.1827 190.8021 214.8702 228.4891 232.0268 262.2864 273.4782 286.8869 291.1523 317.5604 338.5841 367.5342 390.9687 413.6636 423.7759 447.6024 474.0744 514.9131 530.2610 557.4824 589.2877 650.6156 673.5801 697.9872 708.5227 725.6655 739.6510 773.3227 813.9968 817.5246 823.2882 845.0784 851.9690 884.3626 907.4586 920.9536 942.9855 947.6745 951.6366 969.2630 1003.1683 1012.3596 1028.2186 1042.8593 1048.7377 1058.7556 1083.4165 1098.4171 1111.1153 1113.8745 1120.7480 1142.2103 1147.3474 1175.5807 1195.8178 1222.7986 1230.3147 1244.5783 1250.7751 1260.9392 1264.5122 1276.7389 1287.1459 1290.9701 1294.8863 1302.8782 1310.2995 1347.9461 1355.0623 1358.1684 1363.7683 1369.9555 1376.4330 1381.8724 1388.8534 1390.2708 1401.1251 1451.3895 1458.3329 1459.2014 1465.9832 1469.0101 1471.0566 1475.2371 1477.1097 1477.7444 1479.1321 1485.5809 1486.8768 1571.4852 1597.0098 2886.8817 2900.3871 2912.8928 2934.1102 2967.2597 2967.6104 2971.9607 2973.5601 2974.6314 2978.6946 3006.3961 3009.3236 3022.3868 3030.5737 3038.5546 3043.3901 3061.8394 3069.0001 3070.2687 3074.1615 3075.1698 3131.4928 3168.7560 3179.7470 3186.6850
redmass: 4.7207 5.9084 3.8558 2.2578 4.3592 4.4752 1.7187 3.1501 2.9702 2.4926 5.7570 6.7354 4.3615 7.2814 9.9415 1.3922 1.1642 1.9382 2.5556 2.2710 4.0860 2.6860 4.3632 3.6733 2.7966 2.3923 6.8020 4.4022 3.3181 6.5851 2.4138 3.0267 3.4128 3.7721 5.5400 4.5220 2.0148 1.3823 1.6545 1.1450 1.7430 1.6054 1.8389 1.8791 2.5604 1.5369 1.5486 2.2701 1.5590 1.4723 1.4442 1.3535 1.8230 4.9852 2.4409 3.4606 3.9093 2.6493 2.2485 2.1352 1.8857 1.9601 2.1819 2.0176 1.5115 1.8817 2.3324 2.2739 1.3423 1.3596 1.3914 1.3863 1.2925 1.2914 1.2613 1.1109 1.1293 1.2564 1.2741 1.2615 1.3830 1.5042 1.4753 1.3585 1.6868 3.8042 2.5788 1.2156 1.2133 1.4632 1.1210 1.1085 2.1010 1.1686 1.0891 1.0706 1.0547 1.0457 1.0479 1.0730 1.0761 1.0849 8.0074 6.7201 1.0698 1.0703 1.0819 1.0693 1.0586 1.0564 1.0408 1.0463 1.0524 1.0625 1.0949 1.0958 1.0918 1.0971 1.1001 1.0946 1.0934 1.1011 1.1003 1.0990 1.0996 1.0894 1.0952 1.0918 1.0636
irintensity: 0.0453 0.1003 0.0421 0.3690 0.5740 0.3163 0.0670 0.3729 0.8443 0.0251 0.6260 0.7500 0.2663 0.8210 0.5776 0.0588 0.1486 0.0988 1.9121 0.4659 1.9262 0.3373 2.3865 9.0463 0.5262 1.2458 3.4922 1.2904 6.2669 32.5888 3.1391 0.1574 3.9591 7.9486 14.7497 6.5179 18.7667 94.4356 3.0201 4.8716 32.5712 18.1909 15.1204 5.7159 3.7649 5.1771 8.5754 38.2889 19.5912 5.9575 11.5541 1.2497 9.4529 31.2374 10.3133 15.9584 56.4788 26.7948 5.2878 28.9346 13.5200 16.6626 6.7151 3.7901 5.2814 23.0769 17.3417 20.2311 8.7368 10.0262 5.9266 11.2698 4.9977 15.7073 3.2178 1.7735 2.7758 7.6435 1.9291 3.4120 4.0144 3.9538 0.5524 2.5567 22.7865 3.2811 33.7317 12.4802 12.2018 71.6160 5.7570 1.2195 57.4996 23.5821 6.8965 10.5452 7.6528 7.7862 15.6534 1.4497 15.7696 24.8240 13.1275 5.6137 54.2619 93.4993 42.7682 72.8462 4.7295 25.0724 52.7687 21.2562 72.7301 60.7262 4.8047 1.9085 23.5832 28.6707 18.9588 70.0538 18.3489 113.7899 59.3009 47.4708 54.4037 9.8942 3.5902 15.4773 255.2714
temp: 298.150 k
press: 1.00000 atm
elementType: 17 17 8 7 6 6 6 6 6 6 6 6 6 6 6 6 6 6 6 6 1 1 1 1 1 1 1 1 1 1 1 1 1 1 1 1 1 1 1 1 1 1 1 1 1
symmnumber: 1
zpe: 992676.8 jmol-1
zpe.correction: 0.378091 hartree
zpe.thermalcorrener: 0.401141 hartree
zpe.thermalcorrenthalpy: 0.402085 hartree
zpe.thermalcorrgfe: 0.321510 hartree
zpe.sumelectzpe: -1673.206872 hartree
zpe.sumelectthermal: -1673.183821 hartree
zpe.sumelectthermalent: -1673.182877 hartree
zpe.sumelectthermalfe: -1673.263452 hartree
dipole: -5.2550 -2.4699 -3.1903
dipole: 6.6253
quadrupole: -145.4323 -129.3906 -139.0626
quadrupole: -3.6615 0.7989 1.3838
quadrupole: -7.4705 8.5712 -1.1008 -3.6615 0.7989 1.3838
hfenergy: -1673.5849623 hartree
pointgroup: C01 [X(C16H25Cl2N1O1)]
dipole: -1.9863257 -0.7416041 -1.516185 debye
polarizability: 269.3308117|11.8325217|189.753694|1.939688|27.9378299|159.5024696 unknown
InChI: InChI=1S/C16H25Cl2NO/c1-3-5-9-19(10-6-4-2)12-16(20)13-7-8-14(17)15(18)11-13/h7-8,11,16,20H,3-6,9-10,12H2,1-2H3
charge 0 multiplicity 1
45 atoms
Cl 4.409666 1.847009 1.745139
Cl 6.286515 -0.226465 0.003784
O  -0.42686 -0.14371 1.253177
N  -1.926656 -0.268225 -0.961699
C  -2.705209 -1.53579 -1.120073
C  -2.461579 0.863572 -1.782049
C  -0.465492 -0.476283 -1.156128
C  -4.080684 -1.530017 -0.418329
C  -2.156651 2.253943 -1.180228
C  0.167438 -0.9499 0.196377
C  -4.010178 -1.426749 1.121693
C  -2.980803 2.576394 0.086286
C  1.679217 -0.788824 0.186879
C  -5.403143 -1.498174 1.782533
C  -2.6033 3.935759 0.71179
C  2.282892 0.28172 0.884597
C  2.494393 -1.686854 -0.546286
C  3.678812 0.459653 0.83231
C  3.892119 -1.506641 -0.598155
C  4.486342 -0.427887 0.090309
H  -2.8390 -1.772607 -2.203661
H  -2.097532 -2.354357 -0.687981
H  -2.067134 0.803681 -2.824004
H  -3.558084 0.741736 -1.852476
H  -0.237012 -1.199089 -1.971013
H  -0.007123 0.491885 -1.422401
H  -4.600395 -2.470475 -0.696509
H  -4.711087 -0.707233 -0.812552
H  -2.363738 3.021184 -1.954322
H  -1.076116 2.335461 -0.945437
H  -0.079074 -2.024577 0.354432
H  -3.516116 -0.477891 1.4048
H  -3.367335 -2.240325 1.514905
H  -2.835483 1.771702 0.833373
H  -4.059805 2.569896 -0.172486
H  -5.329826 -1.421679 2.882595
H  -6.053134 -0.674796 1.430042
H  -5.911181 -2.451763 1.543171
H  -3.214317 4.152067 1.607007
H  -1.540604 3.947144 1.018155
H  -2.754528 4.762201 -0.008553
H  -1.342987 0.065117 0.874956
H  1.650192 0.950204 1.473797
H  2.046436 -2.536701 -1.074403
H  4.527545 -2.195823 -1.161962
