program: Gaussian 09
title: 000221721
version: EM64L-G09RevD.01
frameworkgroup: C1[X(C16H24O4)]
method: RPBEPBE
basis: SDD
operation: Freq
keyword: #pfreq=noraman
keyword: PBEPBE/SDD
title: #p freq=noraman PBEPBE/SDD
converged: YES YES NO NO
title: Mulliken charges:
elementType: O O O O C C C C C C C C C C C C C C C C H H H H H H H H H H H H H H H H H H H H H H H H
charge: -0.294416 -0.278676 -0.290266 -0.266691 -0.402072 -0.242818 -0.429623 -0.241995 -0.289434 -0.172033 -0.311831 0.276333 -0.695518 -0.686404 0.350059 -0.337441 -0.390650 -0.232762 -0.198408 -0.267773 0.211216 0.212133 0.201386 0.192966 0.208887 0.213173 0.196870 0.207692 0.216406 0.264276 0.231630 0.270297 0.210938 0.253908 0.217642 0.211829 0.251272 0.221023 0.216824 0.272038 0.245912 0.225269 0.223723 0.225107
chargesum: 0.00000
title: Mulliken charges with hydrogens summed into heavy atoms:
elementType: O O O O C C C C C C C C C C C C C C C C
charge: -0.294416 -0.278676 -0.290266 -0.266691 0.021277 0.151534 -0.007563 0.162566 0.191248 0.059597 0.169404 0.276333 -0.012138 0.002716 0.350059 -0.065402 -0.144739 -0.007493 0.025316 -0.042666
polarizability: 2.17651872e+02 -2.54629676e+01 1.74675513e+02 -1.02280393e+01 -8.97020199e+00 1.54963693e+02
1716.lowfreq: -12.1457 -8.2687 -1.0408 -0.0010 -0.0008 0.0003 13.9258 22.9779 26.8872
frequency: 12.6440 22.7827 26.0245 34.4635 47.0251 50.5710 62.7349 80.6009 96.8565 121.6452 140.1521 182.3001 186.3751 194.7878 202.9996 227.2867 236.2218 246.4978 264.0158 278.8126 303.1578 322.9471 376.2792 392.2996 407.7008 409.9199 453.4069 478.9068 502.6334 524.4540 586.7778 609.9764 625.8494 689.3244 707.4503 739.2916 758.4038 765.8444 791.9192 819.6802 824.5884 846.5400 880.5545 885.2598 891.2823 915.2747 926.3134 937.4981 941.9801 958.6494 962.1147 979.2176 983.3718 993.6382 1021.4630 1043.1204 1051.5706 1078.0499 1081.1825 1095.1369 1100.3394 1100.5209 1111.1496 1116.2473 1129.1061 1165.2868 1176.4720 1179.1318 1186.6881 1199.1505 1204.4681 1219.9265 1220.4156 1276.2693 1281.7308 1294.6638 1313.1999 1329.2291 1338.3225 1354.5487 1361.2161 1363.0191 1375.4348 1377.9435 1389.3593 1396.1778 1399.6030 1434.9049 1437.7540 1443.1242 1464.7320 1467.8622 1469.8335 1473.5717 1475.5495 1478.8151 1488.8766 1492.8020 1494.3578 1589.2045 1610.6159 1632.4748 2926.5361 2941.7221 2972.8727 2974.1964 2982.4678 2989.2427 2994.4901 3002.4913 3011.3328 3026.4122 3029.3872 3050.5081 3061.2193 3069.7052 3081.1506 3085.3696 3089.0435 3101.2530 3108.3336 3124.3867 3133.1817 3154.0697 3166.0707 3177.4683
redmass: 3.9771 4.5182 3.0015 4.0200 5.8560 5.1116 5.7967 3.9350 4.0804 5.3555 3.1869 2.6038 1.9910 2.0423 1.4065 2.4232 3.4807 1.6934 2.2667 2.3445 2.6642 3.8830 2.4711 2.5125 3.4977 3.1162 2.8316 2.6638 2.8545 2.6830 4.8106 6.3924 3.4926 2.0987 5.7884 2.3509 1.6406 2.4431 3.3322 1.5103 2.0657 2.7117 2.6324 1.5317 2.2928 2.1667 1.2264 2.6561 2.7244 1.3758 1.4246 1.3172 5.1111 2.1443 2.0505 2.4436 2.0160 2.3104 1.5749 1.9831 2.1874 2.2481 2.5481 2.5632 2.4898 1.0798 1.1819 1.8398 1.0950 1.1552 1.1597 1.4488 2.1496 1.1388 1.1639 1.3431 1.3358 1.3593 1.3504 1.4079 1.4539 1.5186 1.9199 1.2188 3.1086 1.2410 1.3937 1.0942 1.0907 2.3643 1.0440 1.1079 1.0911 1.2266 1.4216 1.0641 1.0708 1.0728 1.1987 6.4463 6.1458 8.7717 1.0551 1.0564 1.0590 1.1024 1.0343 1.0354 1.0940 1.0638 1.0730 1.0844 1.0604 1.1044 1.1011 1.1016 1.1007 1.0998 1.1014 1.0995 1.1063 1.0848 1.0895 1.0937 1.0979 1.0959
irintensity: 0.2322 0.6038 0.1461 0.3514 2.4091 0.8186 1.7315 0.9957 1.0132 5.3952 5.4327 3.3737 4.1800 4.0848 1.9925 5.3775 1.5389 6.4076 5.0415 0.3103 4.3830 12.5489 2.4646 4.8237 0.1092 0.1378 0.7478 2.3875 15.4638 2.7261 3.4382 0.9648 1.0071 41.7109 5.4939 9.2012 101.0092 2.0463 12.3906 0.3461 1.5755 7.3970 2.3709 10.6416 6.8216 1.9309 5.7787 7.9838 72.3986 0.2349 0.8946 1.1293 1.3701 36.8706 10.4468 62.5086 38.2537 53.8544 23.1207 102.1794 42.5251 120.2335 29.9269 75.3174 7.0779 9.8908 47.6165 2.7731 4.4732 5.5180 23.7590 38.5904 148.1011 6.2581 5.1013 4.7498 0.6523 9.6795 31.1285 3.0059 6.0571 3.1758 2.9949 9.8833 9.8945 26.8002 0.7032 16.5620 11.4295 2.0796 5.6713 17.2737 11.4493 48.0282 66.2326 14.1037 15.8309 17.5337 3.2129 19.1286 74.8590 179.9186 37.7972 88.7090 32.1028 57.8304 22.7039 25.1061 20.3857 47.5529 69.9329 14.9638 48.0684 17.4476 30.7512 25.7873 18.2189 40.2541 11.5729 30.2879 11.1177 1.7770 17.1938 29.8504 20.5958 1.1841
temp: 298.150 k
press: 1.00000 atm
elementType: 8 8 8 8 6 6 6 6 6 6 6 6 6 6 6 6 6 6 6 6 1 1 1 1 1 1 1 1 1 1 1 1 1 1 1 1 1 1 1 1 1 1 1 1
symmnumber: 1
zpe: 974626.6 jmol-1
zpe.correction: 0.371216 hartree
zpe.thermalcorrener: 0.393150 hartree
zpe.thermalcorrenthalpy: 0.394095 hartree
zpe.thermalcorrgfe: 0.316519 hartree
zpe.sumelectzpe: -923.423187 hartree
zpe.sumelectthermal: -923.401252 hartree
zpe.sumelectthermalent: -923.400308 hartree
zpe.sumelectthermalfe: -923.477883 hartree
dipole: 2.0218 0.3812 1.3512
dipole: 2.4615
quadrupole: -112.8796 -115.2501 -117.6272
quadrupole: -5.2365 0.0318 -0.5631
quadrupole: 2.3727 0.0022 -2.3749 -5.2365 0.0318 -0.5631
hfenergy: -923.7944023 hartree
pointgroup: C01[X(C16H24O4)]
dipole: -0.8470827 0.1668998 -0.4386869 debye
polarizability: 213.4649613|28.8343563|175.0070917|-13.520327|7.6748033|158.8190249 unknown
InChI: InChI=1S/C16H24O4/c1-14(2)16(17)20-13-7-11-18-10-6-12-19-15-8-4-3-5-9-15/h3-5,8-9,14H,6-7,10-13H2,1-2H3
charge 0 multiplicity 1
44 atoms
O  -2.659732 -1.870154 0.020092
O  -2.7105 1.724652 0.374835
O  1.142367 -2.025698 -0.479657
O  -0.766107 1.030401 1.473329
C  -4.316411 -0.11203 0.040926
C  -3.4195 -0.97393 -0.856055
C  -0.735955 -3.305436 0.309493
C  -1.756097 -2.777465 -0.705618
C  -3.528738 0.690838 1.082619
C  -0.663232 2.832329 -0.231182
C  0.291039 -2.245124 0.714872
C  -1.337676 1.779832 0.64592
C  0.524993 3.483438 0.509154
C  -0.201844 2.155261 -1.555326
C  2.201287 -1.110944 -0.384093
C  2.440365 -0.274557 0.73579
C  3.057574 -1.055183 -1.51411
C  3.547852 0.605602 0.714127
C  4.153524 -0.169718 -1.51988
C  4.409705 0.665141 -0.403539
H  -4.913822 0.572706 -0.59025
H  -5.021548 -0.770661 0.583949
H  -2.721106 -0.337699 -1.443233
H  -4.040525 -1.558664 -1.570115
H  -0.205937 -4.177978 -0.116314
H  -1.280678 -3.646424 1.210342
H  -2.34439 -3.608573 -1.150669
H  -1.234677 -2.233881 -1.521702
H  -4.204395 1.24911 1.753421
H  -2.856651 0.042502 1.668005
H  -1.426917 3.592914 -0.476479
H  -0.205263 -1.30113 1.008315
H  0.927383 -2.601973 1.549808
H  1.273648 2.718444 0.776836
H  0.199114 3.987546 1.4366
H  1.008438 4.233455 -0.142414
H  0.544348 1.366893 -1.350904
H  0.267005 2.909417 -2.212512
H  -1.055044 1.70792 -2.096462
H  1.767055 -0.28026 1.59683
H  2.848967 -1.713377 -2.363652
H  3.730944 1.250173 1.581847
H  4.812332 -0.134395 -2.395142
H  5.265104 1.348982 -0.407904
