program: Gaussian 09
title: 000221700
version: EM64L-G09RevD.01
frameworkgroup: C1[X(C14H26O3)]
method: RPBEPBE
basis: SDD
operation: Freq
keyword: #pfreq=noraman
keyword: PBEPBE/SDD
title: #p freq=noraman PBEPBE/SDD
converged: NO YES NO NO
title: Mulliken charges:
elementType: O O O C C C C C C C C C C C C C C H H H H H H H H H H H H H H H H H H H H H H H H H H
charge: -0.488402 -0.260415 -0.265509 0.238897 -0.453285 -0.456372 -0.393385 -0.391742 -0.393710 0.152161 -0.374442 -0.310849 -0.358632 -0.361650 -0.353918 -0.354349 -0.695223 0.213130 0.216708 0.212800 0.209080 0.229237 0.192390 0.192181 0.228073 0.203031 0.188522 0.363552 0.216436 0.200688 0.242156 0.226322 0.200778 0.207780 0.188078 0.185465 0.190136 0.188397 0.194730 0.194185 0.210551 0.215806 0.210611
chargesum: 0.00000
title: Mulliken charges with hydrogens summed into heavy atoms:
elementType: O O O C C C C C C C C C C C C C C
charge: -0.124849 -0.260415 -0.265509 0.238897 -0.023447 -0.034492 0.028242 0.028513 -0.002157 0.152161 0.042682 0.157629 0.049926 0.011892 0.024615 0.034566 -0.058255
polarizability: 1.76973948e+02 5.48908368e+00 1.57490306e+02 9.83194316e-02 1.08710949e+00 1.42150811e+02
1716.lowfreq: -14.8023 -8.6548 -0.0006 -0.0004 -0.0001 9.6392 20.8380 27.7363 37.6057
frequency: 18.5782 26.3635 34.6814 47.2615 55.7002 77.7904 93.2195 105.7864 111.1961 137.4415 165.1569 195.3335 220.4297 226.1818 227.6318 262.3444 288.9658 311.3695 345.3886 348.4677 366.5118 379.0503 399.8934 416.6280 470.1161 481.3858 496.1744 521.1034 661.5595 692.9904 721.0099 730.7361 742.2757 773.4253 780.6448 823.7264 830.1599 850.6991 861.3983 888.5846 910.4657 920.0224 927.9090 933.0878 956.1087 978.5958 1001.6832 1023.6619 1044.6562 1053.2956 1058.2735 1061.2466 1074.7876 1083.6982 1099.1517 1119.8540 1133.8881 1145.2910 1149.6778 1187.2618 1195.7532 1200.0217 1219.0058 1242.8903 1249.6656 1254.9680 1261.1554 1272.0680 1280.2680 1286.1833 1291.5004 1296.9915 1315.3261 1320.3823 1334.5087 1337.2575 1346.4987 1347.4015 1352.9858 1357.1978 1363.0458 1371.0195 1389.3338 1448.0136 1449.2039 1456.5816 1459.0043 1462.6472 1464.7116 1466.4683 1467.7816 1472.7195 1474.4936 1476.7490 1481.0921 1487.8343 1599.5015 2950.3166 2955.4673 2961.7596 2966.2126 2969.0867 2972.1562 2975.8969 2981.8320 2987.3233 2987.4403 2991.4172 2997.0585 3001.6604 3015.6423 3023.3625 3029.9988 3032.4492 3040.9328 3048.4028 3048.7617 3056.4601 3065.1678 3068.3825 3071.3547 3097.5806 3450.0018
redmass: 3.2297 2.0506 3.2503 4.8884 3.9436 3.7662 2.5271 1.8006 3.3051 2.4587 2.7938 3.2792 2.7125 1.3107 2.0874 3.3522 2.7441 2.9564 2.1019 1.9509 3.3851 3.0816 1.9491 2.5867 2.6000 2.5593 2.1271 2.8128 3.1615 7.5469 1.0803 1.2124 4.0181 1.4178 1.4846 2.5054 2.5183 1.5818 1.7795 1.7615 1.5524 2.4926 2.4224 1.5232 2.2230 1.5677 2.7021 2.8965 2.2272 1.8227 2.5666 1.4848 2.3201 2.0532 1.5253 2.4082 2.6741 1.6648 2.0949 2.5333 1.5985 2.0363 1.2830 1.3070 1.2953 1.2621 1.4373 1.2285 1.1365 1.0889 1.1748 1.1696 1.3861 1.2725 1.4109 1.3743 1.4860 1.4903 1.6203 1.3897 1.5505 1.6232 1.2161 1.0834 1.0858 1.0894 1.0840 1.0704 1.0786 1.0994 1.0834 1.0762 1.0922 1.0424 1.0802 1.0865 9.0313 1.0589 1.0589 1.0633 1.0594 1.0598 1.0364 1.0603 1.0586 1.0945 1.0630 1.0615 1.0618 1.1000 1.0917 1.0729 1.0959 1.0980 1.1020 1.1025 1.1022 1.1035 1.1029 1.1007 1.0992 1.1090 1.0649
irintensity: 0.0632 0.0480 0.2353 1.8922 0.0615 0.3999 0.5656 0.0730 1.4849 0.4665 0.2945 0.7419 2.6918 0.1958 0.9768 0.3964 4.4953 3.4305 48.5350 40.1973 17.9954 21.9489 9.9674 0.4480 1.1432 1.7266 5.0700 1.3622 4.6429 12.4898 11.3632 1.5260 3.4636 0.9584 0.4005 9.3267 5.2377 10.1686 5.6840 4.7085 5.0574 5.5453 7.1408 7.1295 64.3478 27.9707 1.2234 12.0465 30.6551 12.9578 3.3356 2.5561 11.1049 5.6091 0.6933 40.6212 241.4278 3.1700 5.7659 146.6398 1.1433 33.6248 26.4290 1.1432 6.2984 4.3134 3.4554 0.6051 0.4265 0.5790 0.4056 3.6744 0.6464 5.0932 0.4498 0.4614 0.5140 4.0439 1.4780 5.0748 0.2671 25.0502 11.2390 6.9648 3.4135 12.7107 10.5385 2.4132 1.7909 18.9615 16.8208 2.5262 3.6094 12.5228 3.1297 21.0669 153.3758 3.4340 7.4877 37.1475 36.3846 27.8055 34.7547 103.0220 19.3065 2.5737 27.9438 65.8556 22.2552 1.1935 7.9491 29.5113 60.8690 18.6935 39.5294 10.6148 112.1532 11.9370 75.5356 96.3587 54.4998 18.1184 46.9821
temp: 298.150 k
press: 1.00000 atm
elementType: 8 8 8 6 6 6 6 6 6 6 6 6 6 6 6 6 6 1 1 1 1 1 1 1 1 1 1 1 1 1 1 1 1 1 1 1 1 1 1 1 1 1 1
symmnumber: 1
zpe: 994984.0 jmol-1
zpe.correction: 0.378969 hartree
zpe.thermalcorrener: 0.398779 hartree
zpe.thermalcorrenthalpy: 0.399723 hartree
zpe.thermalcorrgfe: 0.328152 hartree
zpe.sumelectzpe: -773.381929 hartree
zpe.sumelectthermal: -773.362119 hartree
zpe.sumelectthermalent: -773.361175 hartree
zpe.sumelectthermalfe: -773.432746 hartree
dipole: -2.1985 -0.9628 -2.5030
dipole: 3.4678
quadrupole: -108.0645 -101.6336 -110.1440
quadrupole: 1.7023 -4.5266 2.3125
quadrupole: -1.4505 4.9805 -3.5300 1.7023 -4.5266 2.3125
hfenergy: -773.7608984 hartree
pointgroup: C01 [X(C14H26O3)]
dipole: 0.9085175 -0.14435 1.0075449 debye
polarizability: 176.5129333|-6.4173875|156.3841834|-0.2418707|-4.599512|143.717948 unknown
InChI: InChI=1S/C14H26O3/c1-2-3-4-5-9-12-17-13(15)14(16)10-7-6-8-11-14/h16H,2-12H2,1H3
charge 0 multiplicity 1
43 atoms
O  -2.809456 0.033448 -1.721625
O  -0.671759 -1.277391 0.959009
O  -1.05457 -1.947669 -1.245788
C  -2.179178 0.067238 -0.392699
C  -3.302224 0.034711 0.680193
C  -1.333241 1.370449 -0.26723
C  -4.195494 1.291262 0.574346
C  -2.237426 2.618152 -0.3722
C  -3.361544 2.589611 0.690705
C  -1.257425 -1.158774 -0.284949
C  1.696392 -1.776427 1.460675
C  0.319795 -2.385522 1.173592
C  2.312191 -1.027887 0.258141
C  3.693489 -0.415167 0.580259
C  4.316207 0.344208 -0.612745
C  5.690678 0.971757 -0.286006
C  6.309122 1.725594 -1.483046
H  -3.905813 -0.880456 0.534598
H  -2.83416 -0.021431 1.68135
H  -0.807589 1.359561 0.707177
H  -0.569771 1.380115 -1.068425
H  -4.714558 1.275032 -0.402597
H  -4.970892 1.257279 1.363822
H  -1.62025 3.530434 -0.258959
H  -2.688082 2.644184 -1.382378
H  -4.017329 3.473649 0.573581
H  -2.913167 2.651606 1.704848
H  -2.390418 -0.718757 -2.225762
H  1.616597 -1.093546 2.329262
H  2.367008 -2.605251 1.769675
H  0.324254 -3.024614 0.272869
H  -0.071023 -2.947219 2.038647
H  2.404618 -1.721659 -0.602332
H  1.62332 -0.220792 -0.062735
H  3.594905 0.276979 1.442896
H  4.387702 -1.218977 0.904746
H  4.425569 -0.347926 -1.473685
H  3.619529 1.142666 -0.944076
H  5.579162 1.66572 0.572228
H  6.3851 0.173795 0.048355
H  5.648885 2.547923 -1.818028
H  7.289948 2.164628 -1.223158
H  6.460002 1.046763 -2.343648
