program: Gaussian 09
title: 000221698
version: EM64L-G09RevD.01
frameworkgroup: C1[X(C14H26O2)]
method: RPBEPBE
basis: SDD
operation: Freq
keyword: #pfreq=noraman
keyword: PBEPBE/SDD
title: #p freq=noraman PBEPBE/SDD
converged: YES YES NO NO
title: Mulliken charges:
elementType: O O C C C C C C C C C C C C C C H H H H H H H H H H H H H H H H H H H H H H H H H H
charge: -0.327597 -0.284636 0.433399 0.379414 -0.036510 -0.477874 -0.500507 -0.432996 -0.090670 -0.390356 -0.381498 -0.389007 -0.787804 -0.788166 -0.718461 -0.725770 0.186398 0.208000 0.206393 0.209055 0.221273 0.203323 0.223339 0.216683 0.194657 0.216594 0.214671 0.195828 0.201058 0.187404 0.238034 0.235423 0.209238 0.213924 0.231223 0.218020 0.194854 0.205631 0.247385 0.208719 0.216062 0.215854
chargesum: 0.00000
title: Mulliken charges with hydrogens summed into heavy atoms:
elementType: O O C C C C C C C C C C C C C C
charge: -0.327597 -0.284636 0.433399 0.379414 0.149888 -0.063482 -0.070180 -0.006335 0.126012 0.020894 0.029001 -0.000544 -0.105109 -0.124999 -0.070591 -0.085134
polarizability: 1.74910351e+02 -3.20197965e+00 1.50734453e+02 4.11191216e-01 2.05317152e+00 1.32170511e+02
1716.lowfreq: -27.9195 -10.1848 0.0006 0.0007 0.0007 9.5984 41.9193 75.5275 89.5315
frequency: 40.9469 75.3672 89.4705 104.4627 147.7238 169.1500 186.4708 195.4241 229.0639 235.9773 243.7985 257.9297 259.2573 290.5281 300.2015 309.4193 337.7725 366.3447 378.7361 396.0574 410.4470 428.6023 440.8716 462.5027 482.7074 507.9746 530.7650 550.9408 632.9111 723.6419 760.7362 768.6735 813.9465 837.2488 852.1745 878.2219 894.1338 905.9703 912.1614 916.0963 921.7447 927.3846 939.3331 943.3645 959.3582 974.3377 975.2365 1009.4033 1015.0291 1043.3693 1053.9488 1071.7818 1095.0502 1116.5689 1135.2258 1143.4813 1151.9112 1179.7326 1186.4882 1208.0050 1219.2028 1236.6947 1248.6311 1260.1226 1267.3655 1276.0902 1284.5888 1304.7421 1318.7261 1324.1039 1329.6863 1336.8222 1340.4039 1344.5010 1355.5855 1357.9208 1372.3771 1377.1598 1392.7072 1399.3631 1446.7184 1456.5799 1457.6860 1458.4284 1461.2303 1466.9533 1467.5174 1472.0705 1473.9336 1477.2382 1479.4685 1483.8115 1491.3290 1496.7369 2947.9326 2964.9656 2971.5592 2972.0455 2975.5269 2976.8844 2982.5609 2984.1231 2986.7377 2993.7126 2996.6797 2997.9858 3030.1407 3038.9704 3047.4458 3055.3046 3057.8670 3058.4520 3063.5679 3064.1587 3067.6581 3070.5146 3080.1655 3086.1767 3093.1449 3105.7269
redmass: 3.0968 3.1791 2.6295 3.0121 2.8479 1.6356 2.1463 1.4279 1.6027 2.1294 1.1052 1.1851 1.9682 2.4486 2.4844 2.2928 2.3142 2.4013 2.7414 2.3299 2.5598 2.6927 3.0813 2.4438 2.9419 2.7198 2.8279 2.9574 4.3466 4.2028 2.9981 1.5069 2.4770 2.5099 2.1593 2.0195 2.4807 2.1381 2.2349 1.8772 1.3109 1.5265 2.0049 1.8851 1.6562 1.8156 1.7745 3.1029 1.4842 2.3090 2.6511 1.2315 1.4998 2.1895 1.9475 1.8557 2.4087 1.9236 2.0269 2.4230 2.8229 1.7754 1.3604 1.2672 1.3571 1.4358 1.4512 1.3784 1.5534 1.3574 1.4724 1.4118 1.4474 1.4394 1.3399 1.4114 1.2082 1.2020 1.2117 1.1992 1.0873 1.0829 1.0903 1.0729 1.0573 1.0605 1.0788 1.0523 1.0880 1.0510 1.0537 1.0510 1.0556 1.0537 1.0820 1.0625 1.0384 1.0369 1.0385 1.0395 1.0595 1.0606 1.0603 1.0621 1.0812 1.0625 1.0959 1.1008 1.1017 1.1020 1.0989 1.0985 1.0988 1.1024 1.0980 1.1012 1.0997 1.0981 1.0962 1.0975
irintensity: 0.3293 0.3254 0.0776 0.6734 0.4137 0.6341 0.2794 0.4607 1.1813 0.5863 0.1272 0.5057 0.4548 1.7120 5.0591 0.3121 0.0662 1.1312 2.3550 7.4832 4.7630 2.5281 1.8103 2.1009 0.2056 3.0123 3.6257 5.5878 2.1477 1.7506 1.8937 2.1152 19.1457 10.8819 4.2127 22.3901 23.2180 4.0899 8.7929 19.4752 3.9153 8.3859 3.7569 15.6133 13.5354 11.5667 9.4462 57.2436 4.4399 40.4663 168.6671 2.4966 1.2618 1.0222 6.9025 2.2289 22.9198 4.2769 1.6154 1.3182 0.0344 9.4626 7.3379 4.6651 41.9055 1.6757 1.9833 1.7688 3.7522 2.2481 8.3040 1.3376 0.8786 1.0336 3.9742 17.5533 12.1150 28.2790 19.8813 19.5645 5.9539 3.9934 9.5837 7.6352 4.1901 7.5993 19.8041 2.2925 11.3845 11.5206 2.2140 15.9710 1.5700 34.3316 17.9674 41.9140 27.5634 18.4926 15.9037 52.1229 57.1102 16.4966 27.9251 32.1108 41.0412 18.9063 63.9691 50.6923 20.7271 30.9833 6.3002 10.2746 43.6494 88.1609 84.3274 36.8411 34.6350 48.4959 25.7755 25.1124
temp: 298.150 k
press: 1.00000 atm
elementType: 8 8 6 6 6 6 6 6 6 6 6 6 6 6 6 6 1 1 1 1 1 1 1 1 1 1 1 1 1 1 1 1 1 1 1 1 1 1 1 1 1 1
symmnumber: 1
zpe: 986812.0 jmol-1
zpe.correction: 0.375857 hartree
zpe.thermalcorrener: 0.393090 hartree
zpe.thermalcorrenthalpy: 0.394034 hartree
zpe.thermalcorrgfe: 0.333031 hartree
zpe.sumelectzpe: -698.219439 hartree
zpe.sumelectthermal: -698.202206 hartree
zpe.sumelectthermalent: -698.201262 hartree
zpe.sumelectthermalfe: -698.262265 hartree
dipole: 0.7537 0.3263 -0.3200
dipole: 0.8814
quadrupole: -95.7050 -101.1089 -101.6564
quadrupole: -0.8579 -0.3244 3.1840
quadrupole: 3.7851 -1.6188 -2.1663 -0.8579 -0.3244 3.1840
hfenergy: -698.595296 hartree
pointgroup: C01 [X(C14H26O2)]
dipole: 0.2993433 -0.120281 0.127229 debye
polarizability: 174.7241447|3.8376446|150.9261822|-0.2866269|2.0472079|132.1649884 unknown
InChI: InChI=1S/C14H26O2/c1-11(2)12-13(3,4)10-15-14(16-12)8-6-5-7-9-14/h11-12H,5-10H2,1-4H3
charge 0 multiplicity 1
42 atoms
O  -0.178208 -0.249256 0.517561
O  -0.35789 1.767893 -0.782268
C  -1.116011 0.627395 -0.213729
C  1.891979 1.044869 0.0604
C  1.161617 -0.3419 -0.131982
C  -2.153738 1.102976 0.820228
C  -1.777672 -0.083109 -1.409163
C  0.765581 2.13176 0.096848
C  1.828824 -1.611114 0.456724
C  -3.068598 -0.055769 1.284591
C  -2.716866 -1.224993 -0.951826
C  -3.762122 -0.727911 0.075955
C  2.812185 1.338412 -1.153087
C  2.665805 1.152345 1.396592
C  0.904503 -2.840788 0.276771
C  3.209984 -1.910232 -0.178817
H  1.014227 -0.497688 -1.223743
H  -2.760557 1.892691 0.336904
H  -1.631686 1.557149 1.682179
H  -0.99338 -0.464606 -2.089103
H  -2.347222 0.68075 -1.97304
H  0.407163 2.278873 1.13515
H  1.137367 3.093871 -0.29522
H  1.96787 -1.445763 1.543717
H  -3.82214 0.327545 1.999211
H  -2.456191 -0.80496 1.822283
H  -2.109207 -2.02771 -0.490384
H  -3.220517 -1.664481 -1.834215
H  -4.391082 -1.573072 0.416542
H  -4.440365 0.003184 -0.411819
H  3.563771 0.548085 -1.317883
H  2.207821 1.434297 -2.074787
H  3.35398 2.2917 -1.001988
H  2.992781 2.196955 1.563918
H  2.023254 0.859651 2.247544
H  3.570444 0.519862 1.413476
H  0.729721 -3.047524 -0.797675
H  1.370186 -3.740033 0.721397
H  -0.072125 -2.671684 0.757117
H  3.125509 -2.016013 -1.277832
H  3.602386 -2.865092 0.217213
H  3.960915 -1.130566 0.032941
