program: Gaussian 09
title: 000018825
version: EM64L-G09RevD.01
frameworkgroup: C1[X(C8H9ClO)]
method: RPBEPBE
basis: SDD
operation: Freq
keyword: #p
keyword: freq=noraman
keyword: PBEPBE/SDD
title: #p freq=noraman PBEPBE/SDD
converged: YES YES NO NO
title: Mulliken charges:
elementType: Cl O C C C C C C C C H H H H H H H H H
charge: -0.058776 -0.445900 -0.197066 0.437797 -0.676644 -0.427908 -0.367824 -0.199610 -0.207721 -0.106700 0.199664 0.232645 0.216058 0.238376 0.239211 0.272943 0.255755 0.255539 0.340161
chargesum: 0.00000
title: Mulliken charges with hydrogens summed into heavy atoms:
elementType: Cl O C C C C C C C C
charge: -0.058776 -0.105740 0.002598 0.437797 0.010434 -0.188697 -0.094881 0.056146 0.047818 -0.106700
polarizability: 1.41130706e+02 1.18825816e+00 9.09252360e+01 -4.63624531e-01 -4.42958871e+00 5.61234812e+01
1716.lowfreq: -13.2597 -0.0027 -0.0014 -0.0006 6.5448 9.3060 45.1881 78.4480 157.8900
frequency: 45.0622 78.3729 157.8860 196.5039 224.8848 263.9169 311.1602 364.4969 376.3500 403.6455 413.2660 505.5687 533.6664 621.4791 641.0453 722.3832 764.5084 829.3569 836.3002 876.1942 951.9469 971.3616 985.6073 999.7465 1051.2908 1070.5892 1075.6917 1110.8310 1179.1813 1202.0089 1240.7832 1283.4101 1311.9972 1345.9577 1382.5317 1386.9714 1397.7343 1457.1822 1469.2353 1477.5426 1587.9200 1599.3719 2942.5092 2995.0618 3098.1960 3102.2366 3125.1937 3143.9843 3167.8137 3171.0426 3550.6073
redmass: 3.6493 5.0200 4.5236 4.0987 1.1495 5.8216 4.1997 1.1918 4.0482 3.6911 3.0760 4.4636 2.7791 6.4597 4.3592 3.4985 4.0140 1.3923 1.3470 2.7004 1.3487 1.3597 2.2607 4.0561 1.6638 2.8002 1.8683 1.3599 1.1123 2.1109 1.2701 1.3481 1.4679 1.5803 3.9581 1.3786 2.3749 1.0701 1.1632 1.9336 7.3306 6.2444 1.0847 1.0349 1.1001 1.1009 1.0898 1.0888 1.0952 1.0965 1.0660
irintensity: 1.4537 0.0706 1.4838 0.6545 3.1182 2.4446 15.8496 153.9801 7.6492 7.9673 13.3005 20.5609 36.8163 1.2452 2.7323 3.3421 14.0808 41.0038 24.9741 29.4964 0.8051 0.3584 34.9597 36.9217 32.7294 29.7912 44.6732 7.1729 0.1963 4.7614 39.3967 13.4736 4.8144 30.0027 4.2363 19.1329 11.1691 7.3604 16.0056 52.9788 2.6354 13.7352 50.7170 16.7250 22.4525 33.0174 11.7810 1.8846 6.9174 0.6212 6.6944
temp: 298.150 k
press: 1.00000 atm
elementType: 17 8 6 6 6 6 6 6 6 6 1 1 1 1 1 1 1 1 1
symmnumber: 1
zpe: 388795.8 jmol-1
zpe.correction: 0.148085 hartree
zpe.thermalcorrener: 0.157910 hartree
zpe.thermalcorrenthalpy: 0.158854 hartree
zpe.thermalcorrgfe: 0.112243 hartree
zpe.sumelectzpe: -844.786828 hartree
zpe.sumelectthermal: -844.777002 hartree
zpe.sumelectthermalent: -844.776058 hartree
zpe.sumelectthermalfe: -844.822669 hartree
dipole: 0.9569 1.1811 -0.5876
dipole: 1.6297
quadrupole: -77.1300 -60.3394 -65.2393
quadrupole: 3.7722 -0.0952 -1.1245
quadrupole: -9.5604 7.2301 2.3303 3.7722 -0.0952 -1.1245
hfenergy: -844.9349126 hartree
pointgroup: C01 [X(C8H9Cl1O1)]
dipole: -0.3834831 0.4949209 -0.138182 debye
dipolederiv: -0.883014 0.0534068 0.0007074 0.0582484 -0.117816 0.0252696 -0.0009706 0.0262975 -0.0906421 -0.7249044 0.1637652 0.2038443 0.1843595 -0.3097719 0.0810821 0.2557958 0.0654479 -0.6893683 0.5956064 -0.0708643 -0.1005174 -0.1410038 0.3388674 -0.0071227 -0.1797364 -0.0048926 0.6458968 0.067221 0.0328495 0.0647979 0.0506487 -0.1085795 0.0198435 0.0381651 -0.0064678 -0.1515182 -0.1084128 -0.0472228 -0.0667604 -0.0167465 -0.0147278 -0.0905996 0.0520503 -0.0670446 -0.0273502 -0.0194879 -0.0417042 0.0127421 0.0099777 0.0090305 -0.1090992 0.0104971 -0.1149555 -0.0778012 -0.0377526 0.0275172 -0.0323863 -0.009553 -0.0031875 -0.0845952 -0.0422186 -0.0830314 -0.0978761 -0.3101846 0.0765899 -0.0351441 0.0940564 -0.036366 -0.0391796 -0.0631593 -0.0403432 -0.0659477 -0.2973365 -0.0463686 0.033522 -0.03948 -0.0158104 -0.0598249 0.0389174 -0.055861 -0.0642317 1.2514342 -0.0868998 -0.0073713 -0.1083377 0.063723 -0.0784202 0.0058737 -0.085804 -0.0230843 -0.0108612 0.0081051 0.0231125 0.0581218 -0.1922088 0.0737768 -0.0218622 0.0599913 -0.0420208 0.0889146 0.073635 -0.0372239 0.0412956 -0.0933034 0.0158633 -0.0178794 0.074433 0.0748944 0.09201 -0.0269893 0.091669 -0.0072589 0.0756434 0.0584642 0.0699313 0.0168578 -0.1030282 -0.1995726 0.0059747 -0.0302354 -0.0125903 0.0905357 -0.022096 -0.0304054 -0.0105578 0.1021318 0.0253865 0.0901193 -0.0447177 0.0714114 0.0037807 0.0859244 -0.0315735 0.0860492 0.0915956 0.0526782 -0.0627582 0.0432358 -0.0586725 0.0460213 0.0628282 0.0361432 0.0659938 0.1079543 0.0355469 -0.0608349 0.0453998 -0.0559599 0.0516608 0.0752893 0.0425731 0.0751726 0.1161243 0.0527981 0.0587353 -0.0328141 0.0596537 0.0378386 0.0788161 -0.0247196 0.0807898 0.1103447 0.3299306 -0.147056 -0.1318601 -0.1781706 0.1746698 -0.0862202 -0.1374219 -0.0820748 0.1839267 unknown
polarizability: 141.1484392|-0.8802706|79.3720928|-0.5784385|-16.9537704|67.6588911 unknown
InChI: InChI=1S/C8H9ClO/c1-6(10)7-2-4-8(9)5-3-7/h2-6,10H,1H3
charge 0 multiplicity 1
19 atoms
Cl 3.907508 -0.212715 -0.013643
O  -2.828176 -0.084444 1.282839
C  -2.244533 0.256804 -0.033002
C  -0.720786 0.156868 -0.011788
C  -2.890898 -0.723915 -1.02432
C  0.078478 1.122458 -0.670311
C  -0.083441 -0.921576 0.65476
C  1.488633 1.017803 -0.681094
C  1.322967 -1.040916 0.659365
C  2.087607 -0.066966 -0.013887
H  -2.530432 1.295392 -0.310758
H  -2.630592 -1.762261 -0.755115
H  -2.537781 -0.528553 -2.051926
H  -3.988878 -0.619141 -0.994569
H  -0.396768 1.968482 -1.182105
H  -0.69659 -1.664456 1.176354
H  2.104527 1.764657 -1.190318
H  1.815503 -1.871104 1.174175
H  -2.404949 0.483381 1.976943
