program: Gaussian 09
title: 000221664
version: EM64L-G09RevD.01
frameworkgroup: C1[X(C12H16O3)]
method: RPBEPBE
basis: SDD
operation: Freq
keyword: #pfreq=noraman
keyword: PBEPBE/SDD
title: #p freq=noraman PBEPBE/SDD
converged: YES YES NO NO
title: Mulliken charges:
elementType: O O O C C C C C C C C C C C C H H H H H H H H H H H H H H H H
charge: -0.271862 -0.454539 -0.262398 0.037963 -0.380273 -0.298589 -0.715391 0.380739 0.228607 -0.698692 -0.364055 -0.384054 -0.223279 -0.217991 -0.241421 0.245390 0.202739 0.221555 0.259661 0.235496 0.252778 0.217280 0.218911 0.232998 0.219124 0.245322 0.268317 0.224906 0.226562 0.227829 0.366364
chargesum: 0.00000
title: Mulliken charges with hydrogens summed into heavy atoms:
elementType: O O O C C C C C C C C C C C C
charge: -0.271862 -0.088174 -0.262398 0.283353 0.044021 -0.038928 -0.009838 0.380739 0.228607 -0.027658 -0.118733 -0.115737 0.001627 0.008571 -0.013592
polarizability: 1.63950692e+02 -1.64698951e+00 1.47815436e+02 1.26973627e+01 4.15990423e+00 9.29592922e+01
1716.lowfreq: -7.5621 -0.0009 -0.0005 0.0003 2.1779 4.2370 20.4407 29.9326 47.6848
frequency: 20.4145 29.9002 47.6796 74.7480 81.4062 116.4571 141.5494 189.1889 204.5183 226.8972 235.3052 271.0161 279.8277 321.6290 365.2908 395.1166 408.9409 414.2711 443.9063 491.9591 543.7267 587.0119 615.2747 659.9712 699.3628 717.5593 749.3059 757.2728 796.1806 836.2275 839.0208 858.0151 902.6081 935.7027 961.7163 981.2342 989.6053 991.4786 999.1974 1010.1797 1018.2636 1028.3617 1084.8515 1102.3832 1134.6640 1164.5065 1167.8907 1170.6509 1174.2214 1188.6845 1227.0435 1268.1522 1269.7321 1317.6897 1319.4170 1337.5709 1357.0181 1367.2903 1387.9563 1389.3716 1393.5045 1436.0470 1455.8105 1464.9509 1477.5262 1478.2249 1485.4361 1493.0952 1594.0741 1606.5265 1613.9893 2985.7385 2990.4975 2996.2994 3025.7589 3028.2923 3040.4313 3082.8123 3090.7936 3092.0123 3108.7197 3122.2400 3131.9542 3144.6838 3158.0595 3170.0188 3450.1845
redmass: 3.8200 3.5652 3.6852 8.7597 2.5359 4.4379 2.7734 2.3408 1.5260 3.4990 1.8268 1.8074 3.1454 5.5686 2.9457 1.8815 3.2367 1.9280 2.6884 3.4555 3.1294 5.4988 6.4279 5.3891 3.2259 1.8035 2.0837 2.2994 1.8747 3.6452 2.6717 1.2466 3.9842 1.5532 1.8757 1.4633 4.3535 1.5600 1.3550 1.3493 4.4284 2.2583 1.6055 1.8267 2.0494 2.0743 1.7281 1.5399 1.4231 1.3277 1.8239 1.2996 1.1848 1.3171 1.6462 1.4007 1.3434 1.5803 4.0077 1.2651 1.2149 2.1837 1.0733 1.0530 1.4254 1.4212 1.0520 1.0515 6.3064 7.2999 7.3488 1.0585 1.0380 1.0374 1.0843 1.0864 1.1000 1.0995 1.0985 1.0997 1.1009 1.0846 1.0883 1.0936 1.0972 1.0978 1.0648
irintensity: 0.2119 0.4231 0.6716 1.0038 0.1720 0.4959 0.3427 3.7389 3.2499 2.1678 3.0191 0.1436 6.8126 25.7724 33.0191 28.6032 6.4530 40.1296 33.5031 19.0840 5.3086 15.3652 0.5440 7.3922 9.5903 78.2745 5.8293 23.2707 22.4868 1.0509 34.7776 0.5950 7.5861 3.4887 23.0879 0.6875 0.3457 4.1518 0.9655 13.9494 123.3230 28.9402 11.2279 46.6354 120.9926 17.5295 58.0387 88.3938 12.5018 3.1813 181.2673 3.6248 1.5686 4.2401 2.6279 2.5835 0.2063 43.7974 10.4527 27.5871 24.6643 13.0225 7.2085 8.9964 11.9028 30.2090 14.2103 3.2788 2.0102 95.6369 69.2655 27.1207 17.8208 17.0219 10.5948 17.1406 14.9606 40.2505 7.6379 65.4403 17.4943 0.4876 7.1215 29.1273 21.8950 13.8691 41.9202
temp: 298.150 k
press: 1.00000 atm
elementType: 8 8 8 6 6 6 6 6 6 6 6 6 6 6 6 1 1 1 1 1 1 1 1 1 1 1 1 1 1 1 1
symmnumber: 1
zpe: 668617.2 jmol-1
zpe.correction: 0.254663 hartree
zpe.thermalcorrener: 0.270290 hartree
zpe.thermalcorrenthalpy: 0.271235 hartree
zpe.thermalcorrgfe: 0.209976 hartree
zpe.sumelectzpe: -691.409206 hartree
zpe.sumelectthermal: -691.393579 hartree
zpe.sumelectthermalent: -691.392635 hartree
zpe.sumelectthermalfe: -691.453893 hartree
dipole: 2.5131 2.7754 -0.7454
dipole: 3.8176
quadrupole: -78.6562 -90.8797 -92.8904
quadrupole: -0.7828 3.7872 0.8107
quadrupole: 8.8192 -3.4043 -5.4149 -0.7828 3.7872 0.8107
hfenergy: -691.6638694 hartree
pointgroup: C01 [X(C12H16O3)]
dipole: -0.9539819 1.1274714 0.2732211 debye
polarizability: 163.1657647|1.0148284|147.7947734|14.8190299|-4.1025175|93.7648816 unknown
InChI: InChI=1S/C12H16O3/c1-3-9(2)15-12(14)11(13)10-7-5-4-6-8-10/h4-9,11,13H,3H2,1-2H3
charge 0 multiplicity 1
31 atoms
O  -1.548861 -0.122147 -0.285493
O  0.973834 -2.691184 -0.777188
O  -1.08979 -2.09348 0.881597
C  -2.807522 0.117272 0.536534
C  -3.009187 1.64163 0.543442
C  0.489308 -1.321803 -0.833291
C  -3.947608 -0.70677 -0.074104
C  1.537872 -0.304456 -0.341565
C  -0.797094 -1.230236 0.014519
C  -3.296339 2.269881 -0.836992
C  1.328205 1.087328 -0.512197
C  2.731507 -0.760009 0.263795
C  2.299676 2.011854 -0.069481
C  3.701253 0.167363 0.709891
C  3.488913 1.555175 0.546698
H  -2.583907 -0.245887 1.557434
H  -3.845431 1.858355 1.238066
H  -2.104616 2.103287 0.983099
H  0.228681 -1.100414 -1.884224
H  -4.09179 -0.462218 -1.139809
H  -3.738569 -1.785571 0.017818
H  -4.890413 -0.492422 0.46213
H  -4.254097 1.916554 -1.25925
H  -2.494483 2.02451 -1.555358
H  -3.355721 3.369806 -0.753697
H  0.405708 1.444936 -0.983671
H  2.896712 -1.837636 0.355313
H  2.131152 3.086002 -0.207684
H  4.624261 -0.19523 1.176482
H  4.242764 2.273042 0.889266
H  0.557583 -3.118633 0.022924
