program: Gaussian 09
title: 000221663
version: EM64L-G09RevD.01
frameworkgroup: C1[X(C12H16O3)]
method: RPBEPBE
basis: SDD
operation: Freq
keyword: #pfreq=noraman
keyword: PBEPBE/SDD
title: #p freq=noraman PBEPBE/SDD
converged: YES YES NO NO
title: Mulliken charges:
elementType: O O O C C C C C C C C C C C C H H H H H H H H H H H H H H H H
charge: -0.269084 -0.284943 -0.267095 -0.010062 -0.017800 -0.152334 -0.727504 -0.705582 0.347682 -0.346829 -0.386746 -0.347753 -0.339692 0.321425 -0.538251 0.215533 0.210928 0.246374 0.229686 0.236779 0.210721 0.235298 0.210126 0.232079 0.259289 0.262248 0.249842 0.239639 0.244710 0.219767 0.221548
chargesum: 0.00000
title: Mulliken charges with hydrogens summed into heavy atoms:
elementType: O O O C C C C C C C C C C C C
charge: -0.269084 -0.284943 -0.267095 0.205471 0.193128 0.094040 -0.050318 -0.028080 0.347682 -0.087540 -0.124498 -0.097911 -0.100053 0.321425 0.147774
polarizability: 1.83719496e+02 5.00306855e+00 1.30330618e+02 8.39858851e+00 -3.80342981e+00 9.79446976e+01
1716.lowfreq: -8.7225 0.0007 0.0008 0.0009 0.7352 12.2494 30.1477 33.4679 56.9448
frequency: 29.8099 33.4285 56.9260 87.5573 133.4402 154.2196 205.9501 213.1766 224.2100 229.2829 262.1702 267.6104 319.6279 329.3598 348.7344 415.1196 445.4687 471.9314 505.3499 513.7302 564.0489 577.7602 628.8689 694.2664 711.6371 765.9886 786.7599 806.8291 814.6982 827.4690 849.7895 866.8960 894.3672 959.2365 975.2597 980.6095 988.2699 1000.0652 1013.5195 1048.2240 1070.2811 1107.5146 1112.0865 1112.7876 1143.7907 1156.2666 1165.8577 1172.2828 1206.6755 1227.4789 1240.1004 1277.0801 1292.2406 1297.0646 1304.9867 1325.4117 1369.8670 1376.4869 1387.7149 1391.4551 1413.5491 1435.7301 1461.5058 1462.1167 1466.7281 1473.3567 1475.3920 1478.2648 1497.0095 1582.9053 1621.6630 2958.3221 2962.5250 2984.3370 2990.6467 2992.2438 3032.2207 3045.4105 3078.9508 3087.9845 3098.1942 3100.7292 3123.8262 3143.6548 3144.4720 3164.0559 3168.7650
redmass: 3.3934 3.5812 3.6291 3.5178 4.6474 4.1914 1.1306 2.0016 1.1541 1.4133 2.6883 3.0655 2.6885 4.8950 3.6785 3.0048 4.1274 4.3174 3.3017 3.1277 4.9357 5.0626 7.0489 4.6728 4.5627 4.6973 2.6014 2.7710 2.0209 1.3650 2.2705 2.7671 7.0326 1.4500 1.3417 1.2413 8.4132 3.4401 2.8481 2.6430 1.7490 1.4721 1.2887 2.2089 2.1988 1.3312 1.9948 1.2723 2.3841 3.6842 1.2750 1.3145 1.2359 1.2717 1.1742 1.3318 1.6342 5.4262 1.2372 1.2452 3.9341 1.1712 1.0461 1.0547 1.0502 1.0800 1.0471 1.0480 2.4291 7.4452 6.3948 1.0330 1.0836 1.0378 1.0726 1.0485 1.0873 1.1038 1.0979 1.0988 1.1007 1.1003 1.0993 1.0880 1.0873 1.0955 1.0967
irintensity: 1.1186 1.8630 0.2849 3.8862 6.0281 0.9791 0.0881 3.8649 0.4720 0.2042 1.7349 0.4984 1.5973 2.5095 5.7937 0.1500 1.0405 1.7813 5.7698 18.1329 26.7619 5.8686 1.9373 7.6428 3.9085 4.5740 2.3768 17.7726 45.4833 5.8827 23.3700 35.8779 58.6276 26.6881 0.8136 17.9194 48.5147 57.9681 36.5269 140.0976 4.0586 2.6618 0.6112 11.6940 1.7893 1.5092 2.3832 97.6601 10.6916 189.6799 17.5669 3.8204 57.0506 0.8345 4.1702 1.8892 0.9010 8.7149 24.3822 21.5867 3.1625 9.0425 12.1019 2.7916 13.2685 55.6315 8.7894 12.5406 76.6936 13.2725 71.2301 67.0682 17.4709 22.4641 30.7543 59.8922 31.5960 50.3745 32.2196 24.5469 13.9859 43.7380 26.7160 4.2258 4.0097 14.6211 4.6997
temp: 298.150 k
press: 1.00000 atm
elementType: 8 8 8 6 6 6 6 6 6 6 6 6 6 6 6 1 1 1 1 1 1 1 1 1 1 1 1 1 1 1 1
symmnumber: 1
zpe: 671007.3 jmol-1
zpe.correction: 0.255573 hartree
zpe.thermalcorrener: 0.270422 hartree
zpe.thermalcorrenthalpy: 0.271366 hartree
zpe.thermalcorrgfe: 0.212789 hartree
zpe.sumelectzpe: -691.375268 hartree
zpe.sumelectthermal: -691.360420 hartree
zpe.sumelectthermalent: -691.359475 hartree
zpe.sumelectthermalfe: -691.418053 hartree
dipole: 0.4275 1.9666 1.8833
dipole: 2.7562
quadrupole: -76.0224 -87.3886 -91.0216
quadrupole: 6.2951 -4.8056 1.4035
quadrupole: 8.7885 -2.5777 -6.2108 6.2951 -4.8056 1.4035
hfenergy: -691.6308416 hartree
pointgroup: C01 [X(C12H16O3)]
dipole: 0.0667968 0.9294323 0.5546071 debye
polarizability: 181.5298116|12.3240462|129.02201|9.5259868|-9.3933034|101.4429902 unknown
InChI: InChI=1S/C12H16O3/c1-8-9(2)15-12(14-8)10-4-6-11(13-3)7-5-10/h4-9,12H,1-3H3
charge 0 multiplicity 1
31 atoms
O  -2.169045 -1.493438 -0.242717
O  -2.146618 0.559126 -1.3948
O  3.981881 0.207445 0.741994
C  -2.764726 -0.494591 0.687207
C  -3.107871 0.694718 -0.254437
C  -1.379493 -0.686633 -1.179359
C  -3.954896 -1.138646 1.389598
C  -2.970222 2.077981 0.384764
C  0.025457 -0.395357 -0.654056
C  0.733262 -1.395444 0.063961
C  0.663736 0.836344 -0.918104
C  2.043666 -1.162723 0.516839
C  1.982518 1.085074 -0.472255
C  2.673458 0.079389 0.24791
C  4.680215 1.468434 0.485207
H  -1.988056 -0.178099 1.415854
H  -4.123236 0.555756 -0.676774
H  -1.365768 -1.245956 -2.131689
H  -4.695628 -1.487525 0.648918
H  -3.629135 -2.00459 1.99056
H  -4.443309 -0.414526 2.067032
H  -3.162808 2.869201 -0.359823
H  -3.700789 2.19723 1.207326
H  -1.953036 2.220777 0.789937
H  0.239835 -2.34945 0.27865
H  0.114878 1.607537 -1.468514
H  2.598611 -1.920481 1.078445
H  2.45074 2.049889 -0.689605
H  5.66944 1.349279 0.951134
H  4.151226 2.324764 0.947605
H  4.79911 1.650115 -0.600905
