program: Gaussian 09
title: 000221662
version: EM64L-G09RevD.01
frameworkgroup: C1[X(C12H16O3)]
method: RPBEPBE
basis: SDD
operation: Freq
keyword: #pfreq=noraman
keyword: PBEPBE/SDD
title: #p freq=noraman PBEPBE/SDD
converged: YES YES NO NO
title: Mulliken charges:
elementType: O O O C C C C C C C C C C C C H H H H H H H H H H H H H H H H
charge: -0.290545 -0.265768 -0.273093 -0.062249 -0.047293 -0.124472 0.324708 -0.708397 -0.698677 0.189274 -0.339206 -0.357148 -0.258084 -0.229656 -0.534521 0.225697 0.218722 0.232869 0.240653 0.236873 0.212418 0.238336 0.200860 0.235029 0.258839 0.238493 0.226068 0.223447 0.218438 0.223307 0.245078
chargesum: 0.00000
title: Mulliken charges with hydrogens summed into heavy atoms:
elementType: O O O C C C C C C C C C C C C
charge: -0.290545 -0.265768 -0.273093 0.163447 0.171429 0.108397 0.324708 -0.018452 -0.024452 0.189274 -0.080367 -0.118655 -0.032016 -0.006209 0.152302
polarizability: 1.70897332e+02 -2.20383284e+00 1.48178705e+02 3.57486105e+00 3.48094715e+00 9.25731068e+01
1716.lowfreq: -12.3946 -7.6442 -0.0003 0.0007 0.0008 8.9617 15.5488 41.4872 77.7670
frequency: 13.6663 41.4190 77.7561 96.9530 113.0682 162.4799 198.6278 209.9638 216.3712 230.9875 248.4489 265.1787 293.1590 324.4425 336.6349 397.9674 453.2326 483.0658 502.0143 543.9777 560.6371 613.7021 675.7653 704.7367 721.4531 758.8217 759.3338 777.8876 809.8930 833.4222 851.3196 858.6350 875.5843 948.8043 980.7835 989.6432 990.6045 996.0937 1017.0810 1042.5339 1047.8020 1093.1028 1102.4513 1112.5292 1113.7935 1145.3171 1150.9651 1171.1643 1194.4753 1229.0708 1253.2448 1264.2901 1277.4660 1285.8482 1314.2646 1336.5252 1356.3610 1382.3783 1386.1748 1397.2414 1430.5572 1446.4368 1459.8858 1466.4784 1468.2057 1469.7389 1473.8736 1474.7447 1486.5664 1596.7632 1610.6711 2959.9839 2983.3367 2985.1285 3014.3868 3024.4457 3046.6539 3048.4567 3079.3662 3082.3928 3097.8975 3101.3594 3125.2579 3129.2091 3147.2898 3162.3110 3171.3750
redmass: 3.9636 3.7200 3.6389 3.4150 3.8848 4.1356 2.4488 3.5011 1.2967 1.0568 1.5787 1.6829 3.4350 3.3988 4.0457 3.1972 4.3282 4.2059 3.1859 3.9071 4.8886 5.4562 7.5047 3.3036 3.5617 1.4403 4.6645 2.3983 2.8086 3.8257 2.7856 1.9483 4.3279 1.3765 1.3403 5.8063 1.5385 4.1389 1.8078 2.0782 2.5844 2.1157 1.9924 1.2773 1.7185 2.2371 1.4415 1.1004 1.6557 3.1506 1.3410 1.3600 1.5580 1.3506 1.2089 1.5887 1.5940 1.2332 1.2453 4.0524 1.3979 1.7689 1.0496 1.0549 1.0550 1.2692 1.0496 1.0474 1.8184 7.2004 6.6207 1.0329 1.0368 1.0363 1.0856 1.0873 1.0881 1.1038 1.0980 1.0976 1.1004 1.1002 1.0991 1.0858 1.0902 1.0933 1.0991
irintensity: 2.7715 1.3884 2.4531 6.4953 1.3448 0.5608 0.2262 1.2349 0.5739 0.2952 0.7073 1.7029 2.3337 0.8054 5.1278 6.9211 2.8994 8.9813 1.0326 4.7280 6.2119 14.9532 5.4371 3.0529 26.3807 89.1204 5.8225 7.0102 9.9364 13.1197 6.4783 6.0015 52.0502 2.2844 1.3058 32.1411 36.2975 135.1343 62.3065 15.8903 33.5702 6.3247 21.0108 3.3427 69.5261 6.1518 4.4385 9.4220 12.5370 144.1690 4.8311 2.6837 41.5694 2.9792 2.4201 53.5801 2.8014 24.9542 24.6549 15.9540 18.8952 10.4826 14.8049 2.9145 13.6295 82.4977 14.8122 4.4948 15.7472 15.2248 39.1756 71.8114 24.3345 16.9205 34.1246 33.4738 13.8195 46.6715 6.3123 75.9730 17.1952 32.2182 22.5260 2.0801 14.4745 20.7797 16.7580
temp: 298.150 k
press: 1.00000 atm
elementType: 8 8 8 6 6 6 6 6 6 6 6 6 6 6 6 1 1 1 1 1 1 1 1 1 1 1 1 1 1 1 1
symmnumber: 1
zpe: 670706.6 jmol-1
zpe.correction: 0.255459 hartree
zpe.thermalcorrener: 0.270359 hartree
zpe.thermalcorrenthalpy: 0.271303 hartree
zpe.thermalcorrgfe: 0.212389 hartree
zpe.sumelectzpe: -691.370958 hartree
zpe.sumelectthermal: -691.356058 hartree
zpe.sumelectthermalent: -691.355114 hartree
zpe.sumelectthermalfe: -691.414028 hartree
dipole: 0.2812 0.5476 0.5003
dipole: 0.7933
quadrupole: -67.2578 -82.2433 -94.7846
quadrupole: 5.2797 0.7483 -1.2369
quadrupole: 14.1708 -0.8147 -13.3560 5.2797 0.7483 -1.2369
hfenergy: -691.6264169 hartree
pointgroup: C01 [X(C12H16O3)]
dipole: 0.1061642 -0.1707862 -0.2386646 debye
polarizability: 169.329324|5.5112471|146.024184|-9.5946699|11.8092965|96.2956358 unknown
InChI: InChI=1S/C12H16O3/c1-8-9(2)15-12(14-8)10-6-4-5-7-11(10)13-3/h4-9,12H,1-3H3
charge 0 multiplicity 1
31 atoms
O  -1.668324 0.011736 1.440192
O  -1.384007 -0.683104 -0.810118
O  1.694013 -1.665792 -0.380305
C  -3.018211 -0.239369 0.863586
C  -2.75146 -0.110316 -0.660166
C  -0.697472 -0.589743 0.522092
C  0.554503 0.26269 0.460177
C  -3.569496 -1.607491 1.287774
C  -2.811385 1.328366 -1.190784
C  1.765556 -0.308558 -0.026735
C  0.556149 1.614093 0.862618
C  2.941993 0.473088 -0.126727
C  1.725243 2.403518 0.771065
C  2.913419 1.829463 0.270253
C  2.904484 -2.301498 -0.901995
H  -3.648636 0.582263 1.246029
H  -3.41633 -0.774274 -1.242977
H  -0.463139 -1.631554 0.809448
H  -2.969852 -2.426857 0.852551
H  -3.55138 -1.703217 2.38694
H  -4.614724 -1.725867 0.945385
H  -2.403618 1.3682 -2.215269
H  -3.855613 1.694595 -1.21649
H  -2.213288 2.005152 -0.556025
H  -0.37164 2.028789 1.268627
H  3.872382 0.041014 -0.506626
H  1.708602 3.450657 1.090554
H  3.826069 2.431112 0.191161
H  3.724228 -2.284299 -0.157139
H  3.241449 -1.81396 -1.837186
H  2.613983 -3.341539 -1.110709
