program: Gaussian 09
title: 000221654
version: EM64L-G09RevD.01
frameworkgroup: C1[X(C12H14O4)]
method: RPBEPBE
basis: SDD
operation: Freq
keyword: #pfreq=noraman
keyword: PBEPBE/SDD
title: #p freq=noraman PBEPBE/SDD
converged: YES YES NO NO
title: Mulliken charges:
elementType: O O O O C C C C C C C C C C C C H H H H H H H H H H H H H H
charge: -0.270501 -0.268887 -0.260826 -0.254423 -0.184957 0.580305 -0.425670 -0.503714 0.197534 -0.426464 0.160368 -0.329582 -0.684726 -0.203812 0.301038 -0.755082 0.245315 0.215168 0.221891 0.260251 0.254925 0.252208 0.211655 0.220091 0.233784 0.240881 0.233657 0.249196 0.246507 0.243870
chargesum: 0.00000
title: Mulliken charges with hydrogens summed into heavy atoms:
elementType: O O O O C C C C C C C C C C C C
charge: -0.270501 -0.268887 -0.260826 -0.254423 0.060358 0.580305 0.011389 -0.243463 0.197534 -0.171538 0.160368 -0.077375 -0.019195 0.270726 0.301038 -0.015509
polarizability: 1.78896283e+02 -7.62021346e+00 1.14705694e+02 -5.21607718e+00 -5.75595246e+00 1.29366843e+02
1716.lowfreq: -8.7028 -4.9611 -0.0005 0.0002 0.0006 3.7829 16.1405 32.4678 40.1427
frequency: 14.6637 32.2748 40.0733 57.0721 68.3272 72.1753 109.0094 147.6998 172.0392 197.8390 223.5449 249.4662 267.6525 313.5879 339.7625 387.6346 417.0049 456.9558 485.4749 536.0687 565.3047 582.5719 604.7079 647.0882 676.9941 718.1218 732.7785 776.7342 805.7112 814.4912 837.0262 840.5942 878.1853 880.5882 909.1600 934.4551 942.3248 975.5256 993.1079 1041.9523 1042.8211 1060.1163 1069.6446 1084.7110 1113.4537 1125.2733 1153.5621 1190.1544 1200.1482 1240.1594 1248.8120 1263.6458 1280.5261 1332.7013 1343.5663 1365.1205 1381.1865 1392.7711 1417.4268 1442.6990 1452.4178 1455.5758 1473.4601 1476.5015 1478.0763 1485.9604 1487.9096 1610.8055 1629.2943 1642.5642 2982.8056 2999.3152 3002.4121 3005.1441 3029.2743 3052.5269 3079.2640 3087.8046 3098.3326 3103.5230 3140.1008 3152.6524 3172.7235 3183.9570
redmass: 4.7083 1.4141 3.0348 3.0859 2.4942 2.8596 3.9219 2.4723 3.1063 4.2711 3.2972 1.7087 6.0709 3.7412 4.8977 4.6457 3.1724 4.1622 3.6042 3.7644 3.8233 4.6994 5.4012 4.7315 9.0304 3.3684 3.4143 4.8627 1.8253 1.5689 5.8988 3.0298 3.2302 1.6435 3.7072 1.5859 1.8740 5.1468 1.8379 1.6538 2.1261 3.2725 1.4884 1.8981 1.7972 1.0608 1.6917 1.8652 3.2384 1.2814 3.4023 1.3904 1.2318 1.5164 1.9222 1.2889 1.2428 1.2188 2.5378 4.2242 1.0591 1.0534 1.0711 2.0162 1.0514 1.3137 1.1324 7.7778 8.3171 9.5909 1.0361 1.0608 1.0594 1.0379 1.0868 1.0992 1.0999 1.1003 1.0947 1.1120 1.1021 1.0901 1.0926 1.0961
irintensity: 0.1742 1.4026 1.0052 1.9622 14.1673 1.9958 2.9904 0.3606 0.3612 5.9989 0.4613 3.1031 2.4353 2.9135 0.0359 6.6089 5.9521 6.3281 8.1506 7.7615 6.3655 4.2597 5.9409 9.6662 0.4495 4.5951 4.2612 19.9804 30.8367 36.2895 37.1629 1.5872 73.4187 12.4662 58.3230 14.0449 52.0688 134.3252 58.3492 9.1595 3.7372 15.1850 7.1439 9.0321 1.9062 0.5797 6.1490 19.4309 368.9943 6.1202 170.4398 27.3489 14.7484 2.1503 46.0475 4.2403 53.8753 14.7037 2.1187 73.4307 21.5227 22.1864 5.0767 61.5743 17.9364 31.8804 17.0211 6.0071 2.8847 156.0737 29.9862 21.7878 122.7988 3.1778 7.3877 12.0313 44.8815 55.4131 10.5927 31.3319 9.9308 3.8339 2.0557 3.1773
temp: 298.150 k
press: 1.00000 atm
elementType: 8 8 8 8 6 6 6 6 6 6 6 6 6 6 6 6 1 1 1 1 1 1 1 1 1 1 1 1 1 1
symmnumber: 1
zpe: 620722.2 jmol-1
zpe.correction: 0.236421 hartree
zpe.thermalcorrener: 0.252479 hartree
zpe.thermalcorrenthalpy: 0.253423 hartree
zpe.thermalcorrgfe: 0.189814 hartree
zpe.sumelectzpe: -765.360233 hartree
zpe.sumelectthermal: -765.344174 hartree
zpe.sumelectthermalent: -765.343230 hartree
zpe.sumelectthermalfe: -765.406840 hartree
dipole: 0.6943 0.4901 -1.6897
dipole: 1.8914
quadrupole: -85.6837 -90.7760 -95.1449
quadrupole: -3.9595 2.1241 5.4597
quadrupole: 4.8512 -0.2412 -4.6100 -3.9595 2.1241 5.4597
hfenergy: -765.5966532 hartree
pointgroup: C01 [X(C12H14O4)]
dipole: 0.2418455 0.1744068 -0.6817979 debye
polarizability: 179.2927117|-3.9996381|113.4215716|-6.0316012|-5.125438|130.2545365 unknown
InChI: InChI=1S/C12H14O4/c1-3-10(16-8(2)13)9-4-5-11-12(6-9)15-7-14-11/h4-6,10H,3,7H2,1-2H3
charge 0 multiplicity 1
30 atoms
O  -2.468114 -0.338794 -0.642462
O  2.923593 0.205553 -1.632817
O  3.801052 -0.377387 0.523961
O  -2.789371 -1.558829 1.325624
C  -1.79385 0.76628 0.152424
C  -0.312425 0.451422 0.286516
C  -2.137616 2.060399 -0.602999
C  0.5417 0.503767 -0.857337
C  1.886175 0.195657 -0.663388
C  0.214107 0.095523 1.552497
C  2.404648 -0.148061 0.6049
C  1.591393 -0.206004 1.737757
C  -1.627397 3.319623 0.130856
C  4.12061 -0.324373 -0.928545
C  -2.884063 -1.462904 0.080211
C  -3.4324 -2.519465 -0.855593
H  -2.258922 0.770619 1.15561
H  -1.715808 2.019535 -1.624913
H  -3.236948 2.105948 -0.715811
H  0.15815 0.7619 -1.84778
H  -0.464526 0.029758 2.408825
H  1.994249 -0.477651 2.716348
H  -2.055613 3.391712 1.148309
H  -1.914614 4.232701 -0.420299
H  -0.527176 3.311335 0.227289
H  4.964099 0.366106 -1.08446
H  4.327727 -1.349606 -1.288447
H  -2.591677 -3.082674 -1.300634
H  -3.999928 -2.058767 -1.679696
H  -4.066954 -3.220527 -0.293443
