program: Gaussian 09
title: 000221652
version: EM64L-G09RevD.01
frameworkgroup: C1[X(C11H22O4)]
method: RPBEPBE
basis: SDD
operation: Freq
keyword: #pfreq=noraman
keyword: PBEPBE/SDD
title: #p freq=noraman PBEPBE/SDD
converged: YES YES NO NO
title: Mulliken charges:
elementType: O O O O C C C C C C C C C C C H H H H H H H H H H H H H H H H H H H H H H
charge: -0.275427 -0.269742 -0.241405 -0.293808 -0.387166 -0.346672 -0.357347 -0.495619 -0.696077 0.253326 -0.290725 -0.299511 -0.290516 -0.266718 -0.495108 0.203893 0.240229 0.187134 0.191128 0.226649 0.230018 0.183919 0.235204 0.208152 0.206977 0.216197 0.232692 0.235793 0.220529 0.223926 0.205376 0.229168 0.230555 0.203266 0.232276 0.207561 0.201877
chargesum: 0.00000
title: Mulliken charges with hydrogens summed into heavy atoms:
elementType: O O O O C C C C C C C C C C C
charge: -0.275427 -0.269742 -0.241405 -0.293808 0.056956 0.031590 0.061775 -0.038952 -0.064751 0.253326 0.177759 0.144944 0.144028 0.167103 0.146606
polarizability: 1.43699400e+02 1.62732762e+00 1.34156575e+02 -6.09150366e+00 -5.65259706e-01 1.19257450e+02
1716.lowfreq: -10.4083 -7.9529 0.0005 0.0005 0.0007 8.9913 24.0496 28.9549 35.1926
frequency: 23.2749 28.5482 35.0506 48.8786 51.8288 58.4497 81.2778 93.8128 99.0282 115.5421 137.2902 169.3978 175.5165 212.7983 222.8009 231.0813 256.3800 315.7352 341.5024 381.7936 390.6487 399.7454 418.9575 447.4598 484.7272 585.3217 663.8081 735.0428 746.8252 777.2372 798.2476 820.0452 847.0819 869.2273 891.3443 913.3809 929.3020 950.6634 998.6451 1008.7604 1036.8650 1045.9488 1061.3876 1063.5171 1081.4800 1091.0564 1101.9489 1107.5626 1108.9880 1137.7442 1159.8551 1173.6332 1195.5813 1212.8898 1221.1690 1239.6918 1270.6507 1277.7320 1279.6936 1281.7232 1293.5611 1319.4599 1328.3297 1342.5924 1356.2140 1359.6714 1362.7860 1386.4020 1388.9156 1426.6907 1436.1534 1441.7247 1449.2877 1457.7085 1460.8757 1467.7079 1470.5441 1474.9199 1477.3026 1480.0702 1489.6179 1492.6008 1640.0092 2926.3956 2946.7526 2951.7645 2966.7254 2969.7285 2974.8217 2984.2179 2991.5263 2996.1307 3000.9510 3006.4520 3006.9954 3018.5383 3024.5761 3051.5957 3055.8972 3065.6983 3069.8359 3070.3857 3083.7194 3101.6429 3109.7644
redmass: 3.8992 4.7815 2.7167 3.7119 4.8760 3.9583 2.2378 2.0400 2.4818 2.6201 2.8109 2.4982 3.1802 2.0639 1.2723 1.3533 4.7638 2.7603 2.6339 2.9597 2.4966 4.3301 2.9115 3.5549 2.2956 3.9416 2.5062 1.2557 3.0731 2.4029 1.3793 1.3398 2.0838 2.6324 4.0668 1.8746 1.5128 2.7622 2.1550 2.9913 2.3731 3.6940 2.6101 2.5617 3.7717 3.0378 2.4374 2.1204 1.3155 1.6340 1.5146 2.1845 1.2101 1.4049 1.6728 1.1930 1.1281 1.2886 1.1438 1.1733 1.0648 1.2918 1.2211 1.3689 1.3372 1.4789 1.2699 1.3270 1.2182 1.0998 1.1463 1.0860 1.0914 1.0526 1.0755 1.0771 1.0647 1.0592 1.0491 1.0593 1.0748 1.0927 9.6135 1.0347 1.0554 1.0597 1.0614 1.0358 1.0617 1.0654 1.0581 1.0932 1.1025 1.0952 1.0710 1.0614 1.1013 1.1020 1.1004 1.1008 1.1061 1.1003 1.1002 1.0976 1.1046
irintensity: 0.2231 0.1650 0.9958 1.0986 0.2052 4.4306 2.8374 0.4986 6.6272 2.6630 2.1571 0.8120 5.5094 4.9493 6.7756 1.2787 1.9367 8.9682 1.6456 0.4626 4.4702 2.5315 10.8957 6.6278 9.2425 5.8533 3.2696 9.2517 14.6364 14.9717 3.0581 2.9699 3.5384 25.3493 14.5503 9.0650 40.1047 17.2444 1.1506 12.0713 96.9957 22.6846 92.1643 29.0513 35.1633 36.3876 47.9725 2.1718 1.1042 3.2081 8.8811 73.6180 19.6504 9.4603 68.0134 18.6211 8.8678 12.8267 4.1721 7.9324 0.2838 3.0026 0.5572 0.4147 1.0546 6.8307 8.6374 2.6653 11.5426 20.8320 0.7538 10.2452 15.7265 11.4067 3.2899 4.6449 9.0817 8.7604 7.6691 2.1304 7.8560 17.7983 172.7465 73.2788 56.5371 9.6903 32.7348 38.7123 30.8169 40.4842 52.7466 20.0585 99.4293 18.5446 14.3490 21.6148 8.6466 24.9858 40.8231 98.2874 26.7044 71.5617 28.9590 29.6769 11.3184
temp: 298.150 k
press: 1.00000 atm
elementType: 8 8 8 8 6 6 6 6 6 6 6 6 6 6 6 1 1 1 1 1 1 1 1 1 1 1 1 1 1 1 1 1 1 1 1 1 1
symmnumber: 1
zpe: 837881.4 jmol-1
zpe.correction: 0.319132 hartree
zpe.thermalcorrener: 0.338209 hartree
zpe.thermalcorrenthalpy: 0.339153 hartree
zpe.thermalcorrgfe: 0.268664 hartree
zpe.sumelectzpe: -731.980114 hartree
zpe.sumelectthermal: -731.961037 hartree
zpe.sumelectthermalent: -731.960093 hartree
zpe.sumelectthermalfe: -732.030582 hartree
dipole: 0.6081 1.0309 -2.4344
dipole: 2.7127
quadrupole: -90.9936 -97.9191 -89.6419
quadrupole: -3.0394 -1.3248 -2.2369
quadrupole: 1.8580 -5.0676 3.2096 -3.0394 -1.3248 -2.2369
hfenergy: -732.2992458 hartree
pointgroup: C01 [X(C11H22O4)]
dipole: -0.4317808 0.0947047 -0.9714119 debye
polarizability: 136.0990772|-4.1329708|141.6503136|3.1007467|-5.5252544|119.3640354 unknown
InChI: InChI=1S/C11H22O4/c1-3-4-5-6-11(12)15-10-9-14-8-7-13-2/h3-10H2,1-2H3
charge 0 multiplicity 1
37 atoms
O  0.851912 -1.499966 -0.752508
O  -1.339006 -2.384723 1.376306
O  2.898163 -1.075184 0.284597
O  -2.827807 0.47975 -0.469982
C  0.841296 1.488355 -1.098346
C  0.888571 2.093392 0.322408
C  -0.295998 3.048688 0.595948
C  2.010758 0.510813 -1.401514
C  -0.267003 3.645551 2.0195
C  2.008885 -0.729867 -0.526811
C  0.748707 -2.77652 0.013907
C  0.110236 -2.585915 1.395706
C  -1.800307 -1.011606 1.106791
C  -2.38566 -0.913054 -0.307496
C  -3.518301 0.696497 -1.73971
H  0.881088 2.307689 -1.843628
H  -0.124152 0.969341 -1.245203
H  0.879059 1.279378 1.077881
H  1.847519 2.633376 0.467031
H  2.981473 1.013642 -1.250152
H  1.947935 0.185039 -2.457317
H  -0.278214 3.870203 -0.150063
H  -1.244373 2.497989 0.435814
H  -0.313722 2.847109 2.784472
H  0.6620 4.221282 2.193668
H  -1.122995 4.324082 2.190004
H  1.763587 -3.200136 0.129697
H  0.122931 -3.425995 -0.618623
H  0.622763 -1.766523 1.940274
H  0.251671 -3.5232 1.965249
H  -0.976767 -0.280898 1.225746
H  -2.585364 -0.787074 1.850506
H  -1.618053 -1.168195 -1.066771
H  -3.246414 -1.608311 -0.411726
H  -3.801214 1.760799 -1.762884
H  -4.432833 0.070381 -1.813812
H  -2.860474 0.470517 -2.60626
