program: Gaussian 09
title: 000221648
version: EM64L-G09RevD.01
frameworkgroup: C1[X(C11H14O3)]
method: RPBEPBE
basis: SDD
operation: Freq
keyword: #pfreq=noraman
keyword: PBEPBE/SDD
title: #p freq=noraman PBEPBE/SDD
converged: YES YES NO NO
title: Mulliken charges:
elementType: O O O C C C C C C C C C C C H H H H H H H H H H H H H H
charge: -0.253050 -0.269764 -0.251007 -0.647477 0.447632 -0.263232 0.292000 -0.364079 -0.420581 -0.255173 -0.220547 -0.220296 -0.243095 -0.496837 0.245014 0.239724 0.218866 0.252052 0.187354 0.206395 0.262701 0.231871 0.226398 0.225573 0.228087 0.204900 0.236924 0.199646
chargesum: 0.00000
title: Mulliken charges with hydrogens summed into heavy atoms:
elementType: O O O C C C C C C C C C C C
charge: -0.253050 -0.269764 -0.251007 -0.162738 0.447632 0.207686 0.292000 -0.101378 -0.188710 0.138576 0.005851 0.005277 -0.015008 0.144633
polarizability: 1.60393842e+02 -8.70936007e-01 1.24671762e+02 1.63890828e+01 -2.10857157e+00 8.91173225e+01
1716.lowfreq: -6.8000 -2.5715 -0.0006 -0.0004 0.0007 6.6365 15.6762 24.5044 31.7699
frequency: 15.4704 22.9108 30.4251 44.1757 76.2830 100.4943 168.2215 178.0303 219.3425 238.9758 266.1712 292.5311 312.3373 390.4812 403.6588 463.6474 495.5561 518.8449 603.2860 618.9794 699.5244 715.7036 758.7255 790.2516 795.0701 828.7163 854.0316 912.2995 925.4723 947.8523 976.8631 989.1573 989.9648 995.7018 1018.0077 1027.7555 1066.6866 1079.6040 1108.1085 1109.1202 1122.4196 1158.5038 1172.0070 1189.4964 1201.3470 1203.1392 1227.3835 1250.3023 1289.0488 1333.2119 1355.2187 1383.3987 1388.8514 1437.3806 1440.1437 1452.0061 1455.2912 1458.3323 1460.8776 1478.4270 1483.4325 1594.3482 1611.3581 1634.7913 2919.1954 2928.3797 2977.2809 2997.6276 3011.3744 3020.8262 3091.7944 3098.0563 3106.6815 3119.1131 3126.7313 3138.7125 3149.1050 3163.8927
redmass: 4.6672 3.7374 5.3109 3.5988 2.9553 4.4894 4.4346 3.0997 1.6284 3.0108 2.0782 4.4239 2.7496 2.6179 2.8145 3.1832 2.9062 5.0364 4.6753 5.6929 2.9142 1.9926 2.4474 3.5006 2.7675 3.6885 1.2491 1.8127 3.2456 1.9564 1.3975 2.9819 4.2653 1.3496 2.5593 2.2215 2.8517 1.6817 1.6444 1.7653 1.9295 1.4227 1.0553 1.1253 1.6502 1.5474 1.5769 1.1146 1.5912 1.2806 1.3615 6.7676 1.5190 1.1661 2.0234 1.0881 1.1395 1.0520 1.0735 1.0669 2.2151 6.1638 6.1112 9.7362 1.0470 1.0452 1.1014 1.1026 1.0630 1.0601 1.1057 1.0985 1.0970 1.0858 1.0872 1.0922 1.0963 1.1016
irintensity: 0.7527 0.4402 1.0453 0.1623 6.7387 5.8087 1.0553 4.5880 2.8803 3.5469 7.9855 7.7096 1.4274 1.6536 0.0304 1.9304 16.8243 11.5166 7.0385 2.5932 15.6610 58.6615 31.9739 7.2477 9.8592 6.5144 0.3458 23.3308 8.1165 16.9819 0.3379 23.3069 4.6620 0.4642 61.7098 5.4912 79.8291 23.3367 130.2497 100.2035 16.3080 9.6346 1.0391 2.7392 3.5503 8.6786 154.4422 4.5471 74.7504 18.2499 3.9173 1.4795 13.0016 0.1120 10.1545 10.6333 20.6460 12.5887 20.3830 5.3032 21.8987 3.2756 18.4832 161.7410 51.1100 102.0668 54.8883 68.0029 10.3894 28.7043 17.5830 5.9762 28.5707 5.2082 0.9315 22.1503 28.8738 21.4324
temp: 298.150 k
press: 1.00000 atm
elementType: 8 8 8 6 6 6 6 6 6 6 6 6 6 6 1 1 1 1 1 1 1 1 1 1 1 1 1 1
symmnumber: 1
zpe: 596206.4 jmol-1
zpe.correction: 0.227083 hartree
zpe.thermalcorrener: 0.241440 hartree
zpe.thermalcorrenthalpy: 0.242384 hartree
zpe.thermalcorrgfe: 0.181935 hartree
zpe.sumelectzpe: -652.161670 hartree
zpe.sumelectthermal: -652.147314 hartree
zpe.sumelectthermalent: -652.146370 hartree
zpe.sumelectthermalfe: -652.206818 hartree
dipole: 1.4530 -2.6263 -1.3272
dipole: 3.2819
quadrupole: -67.2830 -83.0535 -80.4498
quadrupole: -4.5443 -3.4536 -0.7703
quadrupole: 9.6458 -6.1247 -3.5210 -4.5443 -3.4536 -0.7703
hfenergy: -652.3887535 hartree
pointgroup: C01 [X(C11H14O3)]
dipole: 0.5929579 1.0278111 -0.509071 debye
polarizability: 159.7078667|-13.9349845|100.7006387|-11.169216|-16.2639585|113.774421 unknown
InChI: InChI=1S/C11H14O3/c1-13-7-8-14-11(12)9-10-5-3-2-4-6-10/h2-6H,7-9H2,1H3
charge 0 multiplicity 1
28 atoms
O  1.592642 -0.290765 0.052177
O  4.568192 -0.369954 -0.297464
O  0.419942 -1.583061 1.595959
C  -0.468936 -1.281498 -0.694906
C  -1.774276 -0.520448 -0.450141
C  2.628241 -0.025515 1.092112
C  0.525639 -1.097265 0.445668
C  -2.570131 -0.797565 0.691389
C  -2.2107 0.464406 -1.370283
C  3.800356 0.654968 0.408793
C  -3.782005 -0.103983 0.902508
C  -3.425613 1.157689 -1.160141
C  -4.215756 0.874421 -0.023091
C  5.675443 0.196638 -1.063466
H  -0.677616 -2.365639 -0.763739
H  -0.002321 -0.955916 -1.637482
H  2.180248 0.621076 1.868665
H  2.93605 -0.979497 1.553474
H  4.435301 1.149733 1.17925
H  3.43346 1.433816 -0.2951
H  -2.22871 -1.54595 1.415599
H  -1.60002 0.688479 -2.253462
H  -4.388177 -0.326636 1.787977
H  -3.752192 1.91501 -1.881901
H  -5.157768 1.409823 0.140633
H  5.313611 0.899618 -1.844021
H  6.182221 -0.653845 -1.545274
H  6.397279 0.731161 -0.408237
