program: Gaussian 09
title: 000221647
version: EM64L-G09RevD.01
frameworkgroup: C1[X(C11H14O3)]
method: RPBEPBE
basis: SDD
operation: Freq
keyword: #pfreq=noraman
keyword: PBEPBE/SDD
title: #p freq=noraman PBEPBE/SDD
converged: YES YES NO NO
title: Mulliken charges:
elementType: O O O C C C C C C C C C C C H H H H H H H H H H H H H H
charge: -0.310221 -0.279505 -0.256402 0.016443 -0.295189 -0.694024 0.215483 0.203043 -0.341571 -0.339953 -0.220216 -0.218102 -0.491504 -0.222746 0.248119 0.210596 0.193934 0.245473 0.247686 0.210243 0.270661 0.268073 0.233458 0.230549 0.235617 0.203029 0.204792 0.232234
chargesum: 0.00000
title: Mulliken charges with hydrogens summed into heavy atoms:
elementType: O O O C C C C C C C C C C C
charge: -0.310221 -0.279505 -0.256402 0.264562 0.109341 0.009378 0.215483 0.203043 -0.070910 -0.071880 0.013242 0.012448 0.151934 0.009488
polarizability: 1.85593981e+02 -6.31166588e+00 1.24537093e+02 -4.37458023e+00 -1.19384584e+01 7.86570730e+01
1716.lowfreq: -0.0011 -0.0010 -0.0009 5.0539 7.8373 15.5190 31.9608 46.0139 65.6811
frequency: 31.6980 45.9854 65.5524 66.9300 85.3481 111.0743 163.0217 181.5432 213.1026 219.7144 244.1591 286.3539 314.6068 374.6087 404.8082 420.6746 452.6752 471.6716 525.5902 614.3072 661.1524 679.7974 702.4575 791.3233 795.9951 829.0517 865.7866 901.4703 918.9167 936.5414 955.2052 990.4675 996.7795 1009.1289 1020.0709 1047.2049 1056.3440 1075.0728 1086.8262 1108.6230 1136.8616 1147.8961 1173.7896 1177.9111 1180.7801 1221.2246 1241.1388 1301.2835 1314.1072 1350.0124 1376.7779 1384.6177 1389.7880 1437.9219 1438.2417 1458.4047 1467.1567 1470.0289 1473.7914 1477.8206 1487.9929 1584.6219 1611.2947 1620.7652 2924.2391 2933.7180 2986.4279 2994.0741 3001.9328 3049.7821 3096.5422 3106.3063 3107.3059 3129.6068 3142.2652 3154.7589 3167.1083 3179.4475
redmass: 3.5090 4.2508 3.2780 3.9499 3.2579 2.9984 4.1898 3.9380 1.7328 1.1634 1.9861 4.9468 3.0018 4.6967 2.8313 4.2312 4.0330 2.5934 4.7291 6.4406 6.3789 5.0664 1.5994 7.6216 2.1822 3.5022 1.2442 4.8381 2.3526 1.2979 1.4200 6.2398 1.3834 1.3268 2.8386 2.1056 2.7320 5.6364 1.7670 1.2796 1.6020 1.5631 1.0570 1.7010 1.1297 1.4202 2.6965 1.4480 1.3162 1.3231 1.4618 1.2787 9.9785 2.2379 1.1524 1.0515 1.0564 1.0610 1.0609 2.2722 1.0727 6.8812 6.1927 10.2046 1.0417 1.0475 1.1053 1.0358 1.1029 1.0869 1.0992 1.0975 1.1006 1.0855 1.0891 1.0940 1.0981 1.0973
irintensity: 0.2470 0.4076 1.2035 0.7193 7.8665 1.8874 1.2125 2.6477 2.6692 3.0953 3.5945 12.0912 1.5457 3.2441 0.0021 2.5119 1.1211 4.7645 3.9270 0.6194 6.0471 14.3426 93.1660 10.2314 23.1020 7.1889 0.0653 13.8646 6.3339 1.8681 4.0369 2.0162 0.0285 0.4125 83.4408 63.0195 168.2689 268.0939 30.6164 0.1670 2.1428 1.0588 0.0875 16.5141 41.2819 51.8624 271.4976 24.2893 1.5168 1.1987 21.0308 20.0063 2.8688 14.9611 0.1647 12.8810 20.7807 16.5595 2.3410 5.4753 5.8908 40.4517 10.8560 152.5256 59.5708 79.0705 58.2683 14.2143 65.3213 14.2291 24.0314 32.0914 13.9543 0.2661 11.6357 16.0453 22.5824 7.9874
temp: 298.150 k
press: 1.00000 atm
elementType: 8 8 8 6 6 6 6 6 6 6 6 6 6 6 1 1 1 1 1 1 1 1 1 1 1 1 1 1
symmnumber: 1
zpe: 595856.2 jmol-1
zpe.correction: 0.226950 hartree
zpe.thermalcorrener: 0.241359 hartree
zpe.thermalcorrenthalpy: 0.242304 hartree
zpe.thermalcorrgfe: 0.184040 hartree
zpe.sumelectzpe: -652.173423 hartree
zpe.sumelectthermal: -652.159013 hartree
zpe.sumelectthermalent: -652.158069 hartree
zpe.sumelectthermalfe: -652.216332 hartree
dipole: 0.1166 -3.4400 0.5229
dipole: 3.4814
quadrupole: -64.6120 -82.3678 -84.6718
quadrupole: 4.9515 0.1443 0.6111
quadrupole: 12.6052 -5.1506 -7.4546 4.9515 0.1443 0.6111
hfenergy: -652.4003725 hartree
pointgroup: C01 [X(C11H14O3)]
dipole: 0.0969517 -1.3636792 0.0841358 debye
polarizability: 185.648654|-3.9561569|125.92024|-7.2940878|-7.8325528|77.2192527 unknown
InChI: InChI=1S/C11H14O3/c1-9(8-13-2)14-11(12)10-6-4-3-5-7-10/h3-7,9H,8H2,1-2H3
charge 0 multiplicity 1
28 atoms
O  -0.719886 -0.031807 0.104852
O  -4.367308 -0.241221 -0.280163
O  0.044473 2.106449 -0.44442
C  -2.126695 0.489961 0.160686
C  -2.987639 -0.7244 -0.207315
C  -2.417648 1.055388 1.553182
C  1.639734 0.27539 -0.197206
C  0.282623 0.897367 -0.19945
C  2.750931 1.101841 -0.508375
C  1.840686 -1.09624 0.106788
C  4.05268 0.56044 -0.516151
C  3.145325 -1.633455 0.097851
C  -5.307053 -1.30275 -0.632745
C  4.252259 -0.807991 -0.2132
H  -2.232362 1.276864 -0.607465
H  -2.660649 -1.136262 -1.186518
H  -2.889478 -1.520022 0.564482
H  -1.812012 1.956658 1.744415
H  -3.486674 1.323741 1.613048
H  -2.19975 0.301931 2.331561
H  2.570344 2.157183 -0.73817
H  0.976306 -1.721323 0.346748
H  4.909036 1.199681 -0.756505
H  3.301259 -2.692006 0.332789
H  -6.30427 -0.83642 -0.657098
H  -5.299215 -2.119599 0.120374
H  -5.077669 -1.73458 -1.63026
H  5.264351 -1.228216 -0.219134
