program: Gaussian 09
title: 000221646
version: EM64L-G09RevD.01
frameworkgroup: C1[X(C11H14O3)]
method: RPBEPBE
basis: SDD
operation: Freq
keyword: #pfreq=noraman
keyword: PBEPBE/SDD
title: #p freq=noraman PBEPBE/SDD
converged: YES YES NO NO
title: Mulliken charges:
elementType: O O O C C C C C C C C C C C H H H H H H H H H H H H H H
charge: -0.249423 -0.453385 -0.255367 -0.294563 0.378204 -0.270997 -0.357892 0.215811 -0.364508 -0.381185 -0.677777 -0.224562 -0.218773 -0.239712 0.263830 0.223202 0.232678 0.216810 0.237830 0.248568 0.267381 0.210040 0.229386 0.218016 0.225376 0.226835 0.228083 0.366091
chargesum: 0.00000
title: Mulliken charges with hydrogens summed into heavy atoms:
elementType: O O O C C C C C C C C C C C
charge: -0.249423 -0.087294 -0.255367 -0.030733 0.378204 0.184883 0.096748 0.215811 -0.115939 -0.113804 -0.020334 0.000815 0.008062 -0.011628
polarizability: 1.40186767e+02 7.77298201e+00 1.29844831e+02 1.72900442e+01 -1.12962772e+01 9.94302700e+01
1716.lowfreq: -4.1202 0.0007 0.0007 0.0008 6.3087 11.9047 26.8516 32.3195 54.4777
frequency: 26.1346 32.2759 54.3917 69.1056 85.3534 113.5203 180.8459 218.4486 228.3819 243.4646 283.6692 301.2152 333.4965 381.3337 404.3921 432.9198 477.8876 517.7479 586.9610 615.3400 646.6262 695.2644 710.1444 748.9331 765.5408 833.1509 845.1423 856.4641 879.5438 902.5730 930.1179 937.8846 980.5597 989.4672 998.7305 1017.5517 1028.6721 1045.7367 1084.7836 1121.1229 1157.0456 1164.4154 1170.1321 1174.0578 1188.6713 1225.6398 1248.0820 1268.8327 1291.7534 1308.9734 1318.5626 1363.6148 1370.7159 1388.3305 1395.3509 1436.5673 1455.1206 1476.1178 1478.0221 1480.5238 1488.1336 1594.5001 1608.6855 1618.9188 2980.7056 3004.5380 3026.8069 3029.9893 3052.5807 3078.4947 3086.3216 3110.5358 3122.8675 3132.6763 3145.2931 3158.5083 3170.5673 3453.2849
redmass: 3.9316 3.6802 3.5490 3.9240 2.3248 4.9186 4.3806 1.1892 4.5543 3.2995 3.6814 4.2919 6.3947 2.3512 3.1522 1.4428 3.4072 5.2441 6.7339 6.4311 5.2022 4.1129 1.7878 1.6992 1.2658 4.0633 3.3072 1.2530 1.6607 1.6023 2.0220 2.2943 1.4393 4.5774 1.3591 4.4337 2.2573 3.0351 1.5970 2.2394 2.1241 2.0816 1.2669 1.4613 1.3194 1.7419 1.2401 1.3558 1.1076 1.3012 1.3128 1.3690 1.5525 4.1118 1.2053 2.1831 1.1048 1.0549 2.2043 1.0448 1.0839 6.3180 6.3129 8.0298 1.0361 1.0604 1.0582 1.0843 1.1009 1.1020 1.0990 1.1087 1.0846 1.0884 1.0937 1.0971 1.0978 1.0649
irintensity: 0.1830 0.4769 0.2279 1.0253 0.4220 0.5280 3.4410 0.5910 3.3919 0.4680 4.3028 6.3026 29.3331 58.5914 1.4194 74.7038 6.6891 22.5796 7.8554 0.5376 19.0239 5.6212 75.1467 27.1399 8.9306 1.4914 15.9197 0.7570 15.9656 8.9435 22.2957 7.8276 0.6444 0.4083 0.8675 132.3816 24.9372 6.6689 9.0460 20.4275 121.8253 104.9958 4.4217 6.6405 3.5326 148.3853 6.7034 3.0395 6.1955 6.2514 3.9566 24.4786 15.2150 7.0120 10.5050 12.8353 13.6089 5.7021 19.7255 13.5505 18.6376 1.5207 38.5979 114.9551 33.9686 10.6711 46.7735 9.6229 0.8707 32.5409 33.9334 28.7563 0.4462 7.4054 26.5816 21.8209 13.5104 41.2120
temp: 298.150 k
press: 1.00000 atm
elementType: 8 8 8 6 6 6 6 6 6 6 6 6 6 6 1 1 1 1 1 1 1 1 1 1 1 1 1 1
symmnumber: 1
zpe: 597109.0 jmol-1
zpe.correction: 0.227427 hartree
zpe.thermalcorrener: 0.241626 hartree
zpe.thermalcorrenthalpy: 0.242570 hartree
zpe.thermalcorrgfe: 0.184405 hartree
zpe.sumelectzpe: -652.180852 hartree
zpe.sumelectthermal: -652.166653 hartree
zpe.sumelectthermalent: -652.165709 hartree
zpe.sumelectthermalfe: -652.223874 hartree
dipole: 2.3195 -2.8679 0.3743
dipole: 3.7074
quadrupole: -75.3034 -85.3253 -82.2252
quadrupole: 1.9375 6.0540 -1.2090
quadrupole: 5.6479 -4.3740 -1.2739 1.9375 6.0540 -1.2090
hfenergy: -652.4082791 hartree
pointgroup: C01 [X(C11H14O3)]
dipole: 0.8405877 0.9640654 -0.7010825 debye
polarizability: 135.6234595|-16.7404968|117.4448384|-16.3822096|-16.4409827|116.3935698 unknown
InChI: InChI=1S/C11H14O3/c1-2-8-14-11(13)10(12)9-6-4-3-5-7-9/h3-7,10,12H,2,8H2,1H3
charge 0 multiplicity 1
28 atoms
O  1.546889 -0.745358 -0.836777
O  -0.815639 -2.439421 1.343087
O  1.640977 -1.276458 1.436108
C  -0.47383 -1.577792 0.222847
C  -1.358553 -0.317156 0.155707
C  2.966075 -0.252452 -0.802528
C  3.022808 1.220198 -0.37823
C  1.011375 -1.185589 0.352104
C  -1.324524 0.528387 -0.981689
C  -2.228179 -0.010129 1.227292
C  4.46914 1.759309 -0.451215
C  -2.146966 1.675163 -1.038321
C  -3.047566 1.140552 1.170319
C  -3.008854 1.987588 0.039527
H  -0.600604 -2.165939 -0.703759
H  3.312722 -0.3976 -1.838627
H  3.541034 -0.894265 -0.111046
H  2.360975 1.813403 -1.036578
H  2.636288 1.317459 0.652655
H  -0.654324 0.292725 -1.816218
H  -2.271866 -0.691719 2.081946
H  4.874789 1.693517 -1.478221
H  4.503069 2.819201 -0.143966
H  5.143451 1.194201 0.218704
H  -2.118188 2.321907 -1.92267
H  -3.720543 1.369414 2.004441
H  -3.647159 2.877233 -0.005787
H  -0.129297 -2.290478 2.051991
