program: Gaussian 09
title: 000221644
version: EM64L-G09RevD.01
frameworkgroup: C1[X(C11H14O3)]
method: RPBEPBE
basis: SDD
operation: Freq
keyword: #pfreq=noraman
keyword: PBEPBE/SDD
title: #p freq=noraman PBEPBE/SDD
converged: YES YES NO NO
title: Mulliken charges:
elementType: O O O C C C C C C C C C C C H H H H H H H H H H H H H H
charge: -0.227837 -0.301736 -0.229220 0.096805 0.243013 -0.302357 -0.359427 -0.250691 0.187072 -0.249232 -0.224274 -0.257806 -0.678087 -0.665851 0.277087 0.248191 0.208706 0.210049 0.231565 0.227524 0.218101 0.232932 0.201704 0.240338 0.236009 0.213744 0.250878 0.222798
chargesum: 0.00000
title: Mulliken charges with hydrogens summed into heavy atoms:
elementType: O O O C C C C C C C C C C C
charge: -0.227837 -0.301736 -0.229220 0.096805 0.243013 -0.025270 -0.111236 0.168064 0.187072 -0.017666 0.003250 0.193227 -0.000036 0.021569
polarizability: 1.69412677e+02 2.64026633e+00 1.57860792e+02 4.41113952e+00 8.45450357e-01 7.35236437e+01
1716.lowfreq: -0.0009 -0.0008 -0.0008 4.0275 7.9153 9.1092 17.7958 56.1865 70.4615
frequency: 17.6860 56.1615 70.4347 74.8608 106.6355 113.0506 142.7508 179.6512 227.2454 234.6119 251.9829 290.8183 307.7507 336.3485 394.3493 413.7582 449.6760 512.7328 528.8554 593.8328 645.8363 677.7583 737.0669 760.7786 767.3708 770.6507 814.1313 827.8543 842.6183 863.0931 905.0034 959.8646 987.9955 988.5908 1025.7699 1031.9844 1050.2099 1094.3665 1114.2743 1131.6214 1133.5938 1152.3299 1176.5176 1216.2855 1230.1828 1263.5882 1275.1439 1281.8169 1354.5346 1360.9815 1385.9822 1387.0342 1400.8410 1429.8730 1455.5381 1458.2454 1462.0226 1469.5446 1480.8354 1484.3943 1491.3127 1581.5282 1600.7536 1632.5495 2956.4510 2990.3846 2999.5029 3017.5390 3025.6878 3084.5729 3089.6635 3096.9880 3112.1854 3115.1140 3133.1056 3156.4248 3172.5524 3185.6295
redmass: 4.4063 3.6086 3.4631 3.9161 2.4105 2.6548 3.0766 2.1461 1.4426 1.3831 3.3146 5.2578 3.4298 3.6572 5.4487 3.4724 3.5316 4.5587 3.7578 6.0696 5.6441 4.4018 3.2378 1.9558 2.5243 2.9303 1.4132 1.1369 3.3355 1.4687 3.6196 1.3648 3.5408 1.3436 2.6151 4.7780 2.2517 2.1467 2.2858 1.4449 1.7485 1.6576 1.0752 3.7853 3.4003 1.1453 1.3594 1.2103 1.2976 1.4798 3.3733 1.2944 1.3184 2.2932 1.0966 1.0390 1.0450 1.4483 1.2423 1.0518 1.2921 7.1571 6.4854 9.5965 1.0551 1.0360 1.0365 1.1077 1.0590 1.0982 1.1029 1.0988 1.1013 1.1052 1.0867 1.0915 1.0943 1.0966
irintensity: 1.2227 3.9988 0.6661 2.1507 1.3802 0.5257 0.4969 2.0550 0.8071 0.4064 0.5595 1.2585 10.4442 7.5382 1.6272 1.9560 0.3492 4.3132 6.0624 7.8793 6.7483 19.7583 8.8177 75.7700 18.9012 11.0013 0.2654 1.4369 2.4961 0.1350 45.3032 2.1440 73.2314 1.0767 96.2304 287.6807 13.1192 25.1290 9.7446 6.3760 31.6818 45.7296 11.2729 212.6857 239.9275 0.0386 19.1352 8.9246 3.9992 5.3014 8.5707 20.8711 40.1553 21.6442 22.9711 11.9031 11.1753 81.5928 11.0985 11.3705 19.2159 54.8363 6.3884 247.9020 45.0752 24.5390 23.7617 35.1230 39.9573 37.2226 5.8647 28.5620 29.6475 33.7937 5.5002 19.5203 14.9264 7.8017
temp: 298.150 k
press: 1.00000 atm
elementType: 8 8 8 6 6 6 6 6 6 6 6 6 6 6 1 1 1 1 1 1 1 1 1 1 1 1 1 1
symmnumber: 1
zpe: 595747.8 jmol-1
zpe.correction: 0.226908 hartree
zpe.thermalcorrener: 0.241375 hartree
zpe.thermalcorrenthalpy: 0.242319 hartree
zpe.thermalcorrgfe: 0.183926 hartree
zpe.sumelectzpe: -652.178449 hartree
zpe.sumelectthermal: -652.163983 hartree
zpe.sumelectthermalent: -652.163039 hartree
zpe.sumelectthermalfe: -652.221432 hartree
dipole: 1.6000 1.2282 0.0589
dipole: 2.0179
quadrupole: -60.5507 -79.7113 -85.1970
quadrupole: -0.9864 1.2112 1.2498
quadrupole: 14.6023 -4.5583 -10.0440 -0.9864 1.2112 1.2498
hfenergy: -652.4053578 hartree
pointgroup: C01 [X(C11H14O3)]
dipole: -0.7139534 0.346134 0.0268619 debye
polarizability: 170.074326|-0.5630041|156.0487579|3.3640687|10.1175407|74.6740291 unknown
InChI: InChI=1S/C11H14O3/c1-3-13-10-8-6-5-7-9(10)11(12)14-4-2/h5-8H,3-4H2,1-2H3
charge 0 multiplicity 1
28 atoms
O  -1.188122 -1.421666 0.202709
O  2.510871 0.547524 0.875812
O  1.558335 -1.425586 0.075601
C  0.156933 0.568746 0.468608
C  -1.135994 -0.037793 0.32399
C  0.229283 1.979225 0.626124
C  -2.299504 0.779212 0.328256
C  -2.508765 -2.074059 0.056362
C  1.414849 -0.233768 0.435573
C  -0.92529 2.784828 0.629592
C  -2.191457 2.176211 0.477154
C  3.842878 -0.118283 0.828388
C  -2.234197 -3.570824 -0.056373
C  4.478577 0.026862 -0.558335
H  1.219322 2.426198 0.743509
H  -3.28946 0.32892 0.217932
H  -3.136494 -1.841672 0.941241
H  -3.012582 -1.684523 -0.851844
H  -0.839993 3.869571 0.746855
H  -3.100928 2.787759 0.47511
H  4.423738 0.404862 1.605543
H  3.716772 -1.181752 1.098071
H  -3.184455 -4.123343 -0.172889
H  -1.591607 -3.780892 -0.927508
H  -1.718755 -3.939046 0.846424
H  5.499401 -0.399065 -0.548789
H  3.886637 -0.513159 -1.316047
H  4.550106 1.089214 -0.850066
