program: Gaussian 09
title: 000221639
version: EM64L-G09RevD.01
frameworkgroup: C1[X(C11H14O2)]
method: RPBEPBE
basis: SDD
operation: Freq
keyword: #pfreq=noraman
keyword: PBEPBE/SDD
title: #p freq=noraman PBEPBE/SDD
converged: YES YES NO NO
title: Mulliken charges:
elementType: O O C C C C C C C C C C C H H H H H H H H H H H H H H
charge: -0.270349 -0.285184 -0.009927 -0.019464 -0.144510 -0.726484 -0.703380 0.347656 -0.383280 -0.370327 -0.213525 -0.219873 -0.238912 0.215619 0.212136 0.249099 0.230419 0.236422 0.211386 0.236220 0.209996 0.231990 0.264488 0.259090 0.226499 0.226380 0.227815
chargesum: 0.00000
title: Mulliken charges with hydrogens summed into heavy atoms:
elementType: O O C C C C C C C C C C C
charge: -0.270349 -0.285184 0.205692 0.192672 0.104589 -0.048257 -0.025175 0.347656 -0.118792 -0.111237 0.012974 0.006507 -0.011097
polarizability: 1.44464881e+02 -1.23262056e+00 1.20850219e+02 1.07772995e+01 2.01889460e+00 8.64952139e+01
1716.lowfreq: -16.1020 -10.7739 -4.9065 -0.0003 0.0005 0.0006 17.3830 35.1789 69.8505
frequency: 13.4441 34.5617 69.8285 158.6629 181.9956 200.2349 209.7507 249.5487 291.5536 319.1965 357.4646 404.2439 452.4526 460.6365 514.1565 574.6189 608.0076 614.7143 705.1394 724.2908 738.0470 788.3833 809.3633 843.6200 853.9365 862.4025 895.3414 938.2436 979.7436 986.5882 988.8540 997.4436 1009.0045 1028.6665 1047.6863 1068.7032 1078.3093 1111.3919 1143.4399 1166.4870 1170.4317 1180.1665 1204.0223 1239.9125 1276.2401 1294.4936 1301.9814 1312.6310 1322.9591 1369.3217 1382.2441 1388.7259 1394.3911 1433.1195 1458.9118 1461.4811 1474.8816 1476.7088 1478.8035 1591.9314 1611.7384 2961.6815 2985.4797 2990.7985 2993.3472 3033.6574 3080.1810 3089.5884 3098.5365 3101.1233 3122.3554 3132.6352 3146.4829 3156.2555 3166.0815
redmass: 3.4617 3.8831 3.5295 4.2964 2.5848 1.2589 1.0620 2.6143 3.8788 2.7750 4.1977 2.8609 3.5072 3.9584 3.4411 5.5003 5.7478 6.4322 2.6870 2.8609 2.1527 2.4458 2.7122 2.7400 2.5841 1.2815 6.5293 1.5566 1.2349 1.3792 6.1436 1.4621 3.2995 2.0749 2.6742 1.7600 1.5520 2.7429 2.1996 2.0217 1.0535 1.1536 2.7255 1.2268 1.3122 1.2132 1.1891 1.3115 1.3388 1.6309 8.9413 1.2340 1.2511 2.1956 1.0504 1.0503 1.0627 2.2021 1.0504 6.3410 6.0801 1.0837 1.0378 1.0793 1.0422 1.0872 1.0981 1.0989 1.1005 1.1003 1.0846 1.0883 1.0928 1.0957 1.1004
irintensity: 1.1365 1.3299 0.8133 3.3841 0.7203 0.3276 0.0924 0.8354 1.0026 1.0524 7.2012 0.0183 6.7657 1.4284 6.1023 7.7545 12.5510 0.2155 22.7576 34.4751 50.6157 16.2758 8.2409 16.0666 5.0901 2.5980 61.6448 25.9902 17.9945 0.9140 2.5526 22.5371 68.3995 2.0436 126.9765 4.7962 2.4558 7.5764 1.7782 0.8130 0.0265 13.9615 42.3167 2.3613 3.6154 42.1184 5.7157 0.9397 1.6167 0.8467 0.0062 23.5254 21.0777 12.3902 7.9948 7.5884 12.0020 5.2818 13.3051 0.3354 0.4133 18.6911 22.1284 40.4793 45.2862 28.5517 31.6359 24.3170 13.2475 41.9082 0.0377 9.5677 19.5510 23.7153 17.2902
temp: 298.150 k
press: 1.00000 atm
elementType: 8 8 6 6 6 6 6 6 6 6 6 6 6 1 1 1 1 1 1 1 1 1 1 1 1 1 1
symmnumber: 1
zpe: 588344.1 jmol-1
zpe.correction: 0.224088 hartree
zpe.thermalcorrener: 0.236339 hartree
zpe.thermalcorrenthalpy: 0.237284 hartree
zpe.thermalcorrgfe: 0.183891 hartree
zpe.sumelectzpe: -577.023371 hartree
zpe.sumelectthermal: -577.011120 hartree
zpe.sumelectthermalent: -577.010176 hartree
zpe.sumelectthermalfe: -577.063568 hartree
dipole: 0.5668 0.1699 -2.0326
dipole: 2.1170
quadrupole: -68.7406 -76.0608 -79.1323
quadrupole: 0.5839 -1.3123 -0.1618
quadrupole: 5.9040 -1.4162 -4.4877 0.5839 -1.3123 -0.1618
hfenergy: -577.2474596 hartree
pointgroup: C01 [X(C11H14O2)]
dipole: -0.2373554 0.1408794 0.7858097 debye
polarizability: 143.6106956|5.4385731|120.7461956|10.9089316|-5.0422059|87.4534223 unknown
InChI: InChI=1S/C11H14O2/c1-8-9(2)13-11(12-8)10-6-4-3-5-7-10/h3-9,11H,1-2H3
charge 0 multiplicity 1
27 atoms
O  -1.262369 -1.464231 -0.613495
O  -1.451596 0.775339 -1.311652
C  -2.041982 -0.767663 0.448328
C  -2.484881 0.548513 -0.251831
C  -0.539341 -0.387281 -1.295017
C  -3.174389 -1.683966 0.897745
C  -2.564337 1.768326 0.668429
C  0.787597 -0.050295 -0.610275
C  1.275822 1.278493 -0.594349
C  1.564103 -1.087656 -0.036671
C  2.527868 1.568181 -0.005299
C  2.813857 -0.796165 0.554665
C  3.300281 0.532248 0.569718
H  -1.359711 -0.527106 1.291692
H  -3.44742 0.386992 -0.776968
H  -0.393244 -0.720861 -2.33776
H  -3.812065 -1.958162 0.03918
H  -2.77244 -2.610102 1.342485
H  -3.798993 -1.180406 1.657992
H  -2.813141 2.673528 0.088628
H  -3.350878 1.625376 1.433502
H  -1.59916 1.936055 1.177967
H  0.662595 2.072817 -1.032366
H  1.175139 -2.111814 -0.045504
H  2.899168 2.599352 0.005781
H  3.406624 -1.601925 1.002567
H  4.270993 0.757512 1.026005
