program: Gaussian 09
title: 000221638
version: EM64L-G09RevD.01
frameworkgroup: C1[X(C11H14O2)]
method: RPBEPBE
basis: SDD
operation: Freq
keyword: #pfreq=noraman
keyword: PBEPBE/SDD
title: #p freq=noraman PBEPBE/SDD
converged: YES YES NO NO
title: Mulliken charges:
elementType: O O C C C C C C C C C C C H H H H H H H H H H H H H H
charge: -0.250881 -0.236375 0.012040 -0.632380 -0.392198 0.493544 -0.695274 -0.396916 -0.410516 -0.227179 -0.226414 -0.240773 0.016829 0.270710 0.240606 0.208013 0.239331 0.204898 0.223539 0.218669 0.232062 0.240626 0.228707 0.224176 0.224357 0.227817 0.202982
chargesum: 0.00000
title: Mulliken charges with hydrogens summed into heavy atoms:
elementType: O O C C C C C C C C C C C
charge: -0.250881 -0.236375 0.282751 -0.183760 0.052031 0.493544 -0.021004 -0.156290 -0.181810 -0.003003 -0.002057 -0.012956 0.219811
polarizability: 1.41399650e+02 -1.35340061e+01 1.02454917e+02 3.55598341e+00 1.10968909e+01 1.11974304e+02
1716.lowfreq: -10.9693 -1.6652 -0.0002 0.0007 0.0009 10.4683 16.6915 35.9556 49.9589
frequency: 16.3739 35.9139 49.8305 82.9799 111.6854 176.4894 187.3513 211.4159 235.5565 294.9165 312.6331 350.1859 402.8753 410.8690 498.5432 538.1259 606.9071 617.2551 701.8644 710.0283 746.5592 758.9331 794.0359 816.2346 852.7029 885.2753 917.2271 936.6717 959.3768 975.4753 988.4848 991.4462 994.4509 1027.0524 1054.3801 1084.3020 1090.5497 1096.9940 1140.8339 1172.0058 1187.3285 1200.3105 1216.2112 1256.1706 1277.7043 1324.1555 1330.4306 1336.9915 1343.9048 1361.3710 1382.9324 1394.9401 1440.2214 1460.0141 1467.0320 1482.1047 1484.4626 1490.2726 1594.1325 1614.4508 1619.3845 2984.8980 2988.8934 2996.5178 3024.7009 3030.5699 3042.6053 3062.3643 3082.3445 3089.5276 3111.9795 3122.6245 3135.0447 3145.6957 3162.5681
redmass: 4.0058 8.4659 3.6655 3.6106 2.7606 4.4577 2.1305 1.7105 3.3302 2.3874 3.0853 2.0159 2.8210 3.0194 3.4964 3.3377 3.9717 6.2697 2.4906 2.2784 2.8182 2.1736 1.4668 3.3562 1.2495 2.4383 1.6580 1.8731 1.6096 1.3931 2.1427 3.3795 1.3344 2.1790 1.5041 2.2596 2.1171 4.9602 1.6135 1.0539 1.1164 1.4618 2.2558 1.2006 1.3444 1.2971 1.4140 1.4136 1.1379 1.3612 7.3153 1.2345 2.1490 1.1108 1.0775 1.1116 2.0505 1.0555 6.0574 6.3097 8.3657 1.0599 1.0386 1.0609 1.0868 1.0912 1.0988 1.0995 1.0993 1.1004 1.0874 1.0858 1.0914 1.0961 1.1016
irintensity: 0.0884 1.1426 0.1323 0.6803 0.4425 2.6236 3.9530 1.7886 0.8551 14.2030 2.8823 2.5843 0.1606 10.3142 19.1249 8.7528 1.6917 0.1180 23.2428 37.2745 15.9747 31.5575 6.5243 5.2485 0.1851 5.5818 3.9514 20.2718 2.7545 0.1042 6.4980 2.0637 1.3438 8.0091 3.6056 123.0276 11.5410 197.9558 9.2576 0.0899 0.0718 1.4981 0.1723 4.7656 1.6437 7.2241 3.2068 13.8743 0.6745 0.7751 0.3961 24.3358 7.6720 10.0083 8.4028 12.0890 13.5284 13.9551 1.5282 30.9469 236.7091 24.0330 18.1921 33.4990 11.2879 53.6272 5.7820 18.8243 49.4555 36.1806 10.5190 0.6107 16.6505 42.0015 20.2267
temp: 298.150 k
press: 1.00000 atm
elementType: 8 8 6 6 6 6 6 6 6 6 6 6 6 1 1 1 1 1 1 1 1 1 1 1 1 1 1
symmnumber: 1
zpe: 586646.6 jmol-1
zpe.correction: 0.223442 hartree
zpe.thermalcorrener: 0.236459 hartree
zpe.thermalcorrenthalpy: 0.237403 hartree
zpe.thermalcorrgfe: 0.181670 hartree
zpe.sumelectzpe: -577.038949 hartree
zpe.sumelectthermal: -577.025931 hartree
zpe.sumelectthermalent: -577.024987 hartree
zpe.sumelectthermalfe: -577.080721 hartree
dipole: -0.1571 -1.8814 1.0006
dipole: 2.1367
quadrupole: -74.0270 -80.4234 -75.9411
quadrupole: -7.0761 4.0021 9.1971
quadrupole: 2.7702 -3.6262 0.8560 -7.0761 4.0021 9.1971
hfenergy: -577.2623905 hartree
pointgroup: C01 [X(C11H14O2)]
dipole: 0.1391953 -0.6654012 -0.49453 debye
polarizability: 138.1680688|16.4163909|108.8268807|7.2034517|-11.0843036|108.8339211 unknown
InChI: InChI=1S/C11H14O2/c1-2-11(13-9-12)8-10-6-4-3-5-7-10/h3-7,9,11H,2,8H2,1H3
charge 0 multiplicity 1
27 atoms
O  -1.589009 0.742273 -0.523907
O  -2.327172 1.985442 1.326769
C  -1.391908 -0.493851 0.324566
C  -0.233405 -1.269117 -0.338838
C  -2.725286 -1.265131 0.410527
C  1.116246 -0.582134 -0.186448
C  -3.271114 -1.772037 -0.941657
C  1.57896 0.341707 -1.158182
C  1.92904 -0.835175 0.948801
C  2.821354 0.996724 -0.999369
C  3.171541 -0.182075 1.112324
C  3.622252 0.737326 0.13699
C  -2.043119 1.882626 0.116214
H  -1.102252 -0.146321 1.334385
H  -0.475454 -1.413803 -1.407103
H  -0.205128 -2.272083 0.12977
H  -3.469428 -0.607416 0.8977
H  -2.567253 -2.12059 1.098097
H  -2.608369 -2.531196 -1.394883
H  -4.264454 -2.235874 -0.806064
H  -3.37765 -0.939749 -1.659691
H  0.958273 0.548975 -2.037514
H  1.590109 -1.553113 1.706894
H  3.164711 1.706524 -1.76072
H  3.787742 -0.392143 1.99398
H  4.586575 1.243174 0.259602
H  -2.1112 2.696737 -0.630942
