program: Gaussian 09
title: 000221637
version: EM64L-G09RevD.01
frameworkgroup: C1[X(C11H10O3)]
method: RPBEPBE
basis: SDD
operation: Freq
keyword: #pfreq=noraman
keyword: PBEPBE/SDD
title: #p freq=noraman PBEPBE/SDD
converged: YES YES NO NO
title: Mulliken charges:
elementType: O O O C C C C C C C C C C C H H H H H H H H H H
charge: -0.256520 -0.262517 -0.202349 0.394247 -0.428066 -0.339509 -0.375730 -0.226214 -0.192908 -0.256488 0.261021 -0.388277 0.246526 -0.459895 0.274364 0.243552 0.236232 0.251385 0.224086 0.228148 0.228165 0.267142 0.252224 0.281380
chargesum: 0.00000
title: Mulliken charges with hydrogens summed into heavy atoms:
elementType: O O O C C C C C C C C C C C
charge: -0.256520 -0.262517 -0.202349 0.394247 0.089850 -0.103276 -0.124345 -0.002128 0.035240 -0.028323 0.261021 0.131088 0.246526 -0.178515
polarizability: 1.51326404e+02 1.21365840e+00 1.37827501e+02 -1.64512862e+01 -4.70557781e+00 7.36734226e+01
1716.lowfreq: -13.5976 -4.6497 -0.8920 -0.0009 -0.0006 -0.0005 9.2160 28.2883 42.5687
frequency: 5.4917 28.2834 42.5634 46.7257 88.2623 166.9280 212.3081 235.2872 252.8643 296.3323 298.3086 323.1287 410.0977 471.2691 501.2574 506.3331 554.8173 579.1172 611.4145 634.4708 652.2224 685.4807 691.4626 756.2199 759.8736 821.0541 822.7320 881.1017 892.0026 961.0836 964.4057 982.3032 983.8589 1001.8227 1005.2955 1016.6947 1035.5046 1085.4369 1091.7945 1167.0825 1181.3895 1201.3934 1236.4961 1246.1723 1314.4174 1333.6605 1347.4737 1389.0309 1439.9330 1445.0482 1448.1657 1476.9947 1595.4878 1611.6362 1679.0155 2149.9125 2999.7259 3018.3085 3080.2305 3092.4203 3128.9852 3137.6299 3152.2089 3162.9679 3173.9187 3424.3566
redmass: 5.3763 5.1740 4.4356 5.6031 5.7830 4.3988 5.2571 4.9893 3.0867 4.6717 5.8093 3.0054 2.9157 5.5369 3.0997 3.2930 6.0020 5.5801 6.3665 1.2368 5.7839 1.2585 2.0552 1.9632 3.5842 6.1044 1.2519 6.3133 1.4690 1.3652 4.1997 1.9156 2.3896 2.2040 2.1956 3.0570 3.3034 1.6054 3.6525 1.0912 1.2074 1.9298 1.0933 1.4163 1.3224 1.2187 1.3814 8.6368 1.4915 1.1368 1.3953 2.2634 6.3893 6.4541 10.0682 5.9947 1.0627 1.0584 1.0984 1.1040 1.0847 1.0886 1.0929 1.0963 1.1003 1.1607
irintensity: 0.0371 0.5191 1.1446 0.3027 2.3170 0.5739 0.9883 6.6212 9.2307 2.7620 1.7419 20.8176 0.0276 10.5251 11.4159 2.2165 8.1627 9.6179 0.6917 75.1613 16.7519 63.3058 28.8487 85.9660 27.0307 3.0120 0.7634 57.4421 5.1230 0.0865 48.1251 1.7499 3.6453 15.3307 4.3123 32.3839 196.7674 9.9723 290.0474 7.5321 37.9679 68.5897 8.9424 54.2125 1.4480 11.1138 15.4875 7.4917 13.5414 21.0491 21.1043 94.3139 21.9185 55.2291 167.7507 2.2204 27.4498 21.3037 6.6165 2.8297 3.0047 8.1454 34.6337 19.9790 6.8029 58.3498
temp: 298.150 k
press: 1.00000 atm
elementType: 8 8 8 6 6 6 6 6 6 6 6 6 6 6 1 1 1 1 1 1 1 1 1 1
symmnumber: 1
zpe: 472463.2 jmol-1
zpe.correction: 0.179952 hartree
zpe.thermalcorrener: 0.193392 hartree
zpe.thermalcorrenthalpy: 0.194336 hartree
zpe.thermalcorrgfe: 0.135810 hartree
zpe.sumelectzpe: -649.738577 hartree
zpe.sumelectthermal: -649.725137 hartree
zpe.sumelectthermalent: -649.724193 hartree
zpe.sumelectthermalfe: -649.782719 hartree
dipole: 1.9066 0.7569 -1.6023
dipole: 2.6029
quadrupole: -67.7547 -71.2961 -86.8121
quadrupole: -1.7554 -1.4167 -0.0546
quadrupole: 7.5329 3.9915 -11.5244 -1.7554 -1.4167 -0.0546
hfenergy: -649.9185285 hartree
pointgroup: C01 [X(C11H10O3)]
dipole: 0.7451352 -0.5660339 0.416037 debye
dipolederiv: -1.3095922 -0.3493559 -0.2833313 -0.5608016 -0.5283652 -0.2406437 -0.5110101 -0.2400927 -0.4890253 -1.5871749 0.4698287 0.0194525 0.3707215 -0.5018695 0.0178948 0.0442832 -0.0151827 -0.4753178 -0.7252536 0.0968624 0.0569152 0.1415081 -0.3749475 0.1091637 -0.2639629 0.3064262 -0.739039 0.8561859 0.4244953 0.3036996 0.8155957 0.4851246 0.3066547 0.4926758 0.2606719 0.3222811 0.8630012 0.1580381 0.1985216 -0.0854429 0.1971675 -0.0876251 0.280338 0.0436452 0.1189881 -0.0558515 0.0047852 0.020685 -0.3233862 -0.2392485 -0.0877764 -0.0842669 -0.0015521 -0.2192857 -0.3207971 -0.2139635 -0.0911791 -0.0656813 0.01146 0.0556634 -0.0643075 -0.0213383 -0.1968752 0.1137361 -0.0889937 0.0585266 0.0336361 0.1050681 0.0822976 0.1100194 0.0596399 -0.0859003 0.128548 -0.0134076 0.0868528 -0.0449313 0.1067559 0.0578096 0.0813091 0.0821829 -0.0904509 -0.1367085 0.1072379 0.0634993 0.054501 -0.1150966 0.0563744 0.0385018 0.0650781 -0.154127 1.6747397 -0.4717174 -0.0136156 -0.4992943 0.4314042 -0.1553398 0.3879115 -0.4680672 0.8915523 0.6976274 -0.2443812 -0.1363576 -0.0863791 0.5188185 0.1247012 -0.4152072 0.2885921 0.3723405 -0.1760227 -0.0388792 0.0160955 -0.0317496 -0.0790236 -0.0125127 0.0851809 0.0113691 -0.0873823 -0.2981392 0.0344326 -0.0036602 0.1282005 -0.3536594 -0.0275641 0.0290308 -0.0242704 -0.2868469 -0.0163799 -0.0485371 -0.0332777 -0.0644742 0.0403419 -0.0867752 -0.0416454 -0.0536635 0.065822 -0.022549 -0.0125166 0.0010653 0.090389 -0.0280656 0.1385582 0.0061105 0.0444441 0.0703786 -0.0898 0.0463669 -0.062076 0.0790903 0.0890917 -0.0163625 -0.0665068 -0.0138423 0.1333167 0.1084052 0.0330225 -0.0126004 0.0462712 -0.0387152 -0.057137 -0.0111482 -0.0604649 0.146389 0.0717589 0.067622 -0.004653 0.0419844 -0.0887018 -0.0633458 -0.0151704 -0.0625457 0.1298863 -0.1024214 0.0680387 -0.0607151 0.0691032 0.0723311 -0.0041658 -0.0642663 -0.0044681 0.134205 -0.0040752 -0.0780113 -0.0828892 -0.0831538 0.011312 -0.0810953 -0.0901337 -0.0812535 0.1161311 0.1282097 0.0682378 -0.0249899 0.0015921 0.0107035 0.041231 0.1043232 -0.0007331 0.0119207 -0.065051 -0.0078361 -0.0224717 -0.0097988 0.0450936 -0.05844 -0.0278919 -0.1055094 0.0557543 0.2676041 -0.0113686 0.0065033 -0.0175001 0.2230203 -0.0115653 -0.0041669 -0.0090657 0.2552845 unknown
polarizability: 151.3709242|-8.6832217|128.7048127|13.6223907|23.0710567|82.7515911 unknown
InChI: InChI=1S/C11H10O3/c1-2-8-13-11(12)9-14-10-6-4-3-5-7-10/h1,3-7H,8-9H2
charge 0 multiplicity 1
24 atoms
O  -1.029457 1.417423 1.033013
O  2.512881 0.463167 0.764252
O  1.104296 1.304051 -0.914148
C  -1.854502 0.456251 0.402969
C  0.304019 1.021228 1.43405
C  -1.456449 -0.865042 0.090561
C  -3.163149 0.905224 0.107024
C  -2.388842 -1.736657 -0.520133
C  -4.07853 0.025179 -0.502955
C  -3.698586 -1.302707 -0.818489
C  1.295152 0.958801 0.264014
C  3.631012 0.328208 -0.22894
C  3.767581 -1.058328 -0.685286
C  3.909923 -2.217347 -1.078271
H  0.645448 1.804653 2.131896
H  0.316046 0.054468 1.973573
H  -0.442706 -1.225264 0.292964
H  -3.436083 1.934488 0.358789
H  -2.079646 -2.758544 -0.766977
H  -5.090514 0.376749 -0.732498
H  -4.411947 -1.984343 -1.29319
H  3.428056 1.003458 -1.08035
H  4.527172 0.661212 0.319261
H  4.026427 -3.228028 -1.426124
