program: Gaussian 09
title: 000221634
version: EM64L-G09RevD.01
frameworkgroup: C1[X(C10H18O4)]
method: RPBEPBE
basis: SDD
operation: Freq
keyword: #pfreq=noraman
keyword: PBEPBE/SDD
title: #p freq=noraman PBEPBE/SDD
converged: YES YES NO NO
title: Mulliken charges:
elementType: O O O O C C C C C C C C C C H H H H H H H H H H H H H H H H H H
charge: -0.315836 -0.272800 -0.268627 -0.249047 0.362582 -0.004409 -0.415735 -0.350812 -0.732983 -0.521642 -0.700188 0.253804 -0.262025 -0.665121 0.214321 0.224267 0.244756 0.199722 0.229834 0.236239 0.228573 0.223239 0.274009 0.247852 0.237766 0.208850 0.225324 0.233610 0.222191 0.216211 0.227271 0.248802
chargesum: 0.00000
title: Mulliken charges with hydrogens summed into heavy atoms:
elementType: O O O O C C C C C C C C C C
charge: -0.315836 -0.272800 -0.268627 -0.249047 0.362582 0.209912 0.053289 0.078744 -0.044932 0.000219 -0.028247 0.253804 0.193776 0.027162
polarizability: 1.45192830e+02 -4.09239758e+00 1.13757188e+02 -3.95085177e+00 3.92513366e+00 1.02564716e+02
1716.lowfreq: -13.4861 -8.1352 -0.0005 0.0006 0.0006 5.0412 18.5056 23.1826 49.4225
frequency: 17.6350 21.8543 49.4155 61.8997 82.7044 105.0816 121.6619 163.4091 186.5382 197.4759 217.7418 221.6588 260.6000 276.8838 315.3354 329.8174 363.4770 414.6199 445.2606 463.9181 501.2201 568.1710 577.0399 620.5010 665.7322 731.4008 768.5608 784.5198 804.8516 817.8915 836.3900 888.9927 898.2446 925.5773 948.2574 969.8428 994.2318 1013.1640 1061.6141 1067.2069 1091.9135 1094.1043 1107.2553 1126.2711 1140.5092 1155.2746 1156.1124 1190.0058 1208.7870 1232.5943 1278.1191 1281.5552 1291.6891 1303.1108 1310.9609 1350.3060 1359.1314 1366.7994 1383.1655 1388.8430 1392.6975 1441.7505 1456.2033 1457.7946 1459.8498 1461.1081 1462.5322 1466.5954 1469.9549 1479.1027 1484.1993 1638.9652 2967.0279 2980.1963 2990.0790 2992.1479 2992.8070 3000.5188 3010.3380 3028.4714 3060.1595 3082.8347 3085.9567 3087.0909 3092.3750 3095.3534 3100.9668 3101.3348 3110.3770 3118.5068
redmass: 4.5175 3.5702 3.3377 4.3361 2.8071 2.7496 2.8416 2.3706 1.3843 1.5587 1.0964 1.7465 2.2788 3.2153 2.7268 3.1056 2.9885 3.2027 2.4425 3.5181 3.3653 3.3303 3.2200 4.9029 3.7623 5.6443 1.8707 1.8142 1.8034 2.0170 3.7065 2.0965 2.9990 2.1857 1.5100 1.9895 3.5115 2.8291 2.5373 2.7564 1.8916 2.2083 2.2195 1.9099 2.1647 1.8203 1.9661 1.3694 1.7942 1.9549 1.1302 1.4437 1.3312 1.3052 1.2808 1.3160 1.5260 1.6081 1.2829 1.2346 1.2549 1.0799 1.0958 1.0740 1.0523 1.0563 1.0445 1.0760 1.0779 1.0506 1.0512 8.8337 1.0755 1.0764 1.0365 1.0366 1.0626 1.0362 1.0597 1.0595 1.0972 1.1007 1.0988 1.0973 1.1032 1.0989 1.0995 1.1003 1.1002 1.1059
irintensity: 2.0819 1.3037 1.6426 0.6432 0.3816 4.2835 2.2153 3.5992 0.6620 1.9124 1.2236 1.2429 1.4800 4.1500 14.6974 2.7923 5.5938 7.5764 3.9472 10.8126 16.8664 2.3945 7.2649 2.3263 3.2068 8.5430 26.8090 18.3346 13.3913 9.7944 33.5049 16.2189 11.4278 1.7693 0.7168 9.9918 95.0068 51.0244 44.7401 26.7915 2.8397 76.4971 177.5571 14.5341 93.5817 9.5756 43.6440 39.4064 52.6268 46.4427 1.7547 134.0502 20.7430 16.0958 4.1440 1.3431 3.6380 12.4013 46.8072 20.8732 19.6624 11.0923 19.3722 9.7872 10.4137 0.5970 13.6372 4.7750 24.0968 11.3660 11.6995 139.4353 28.5026 71.6024 24.4411 22.7882 7.4457 12.8900 14.4799 32.5596 3.0853 24.9333 18.7626 36.0636 0.5614 27.7913 18.8375 41.1786 29.3720 34.6200
temp: 298.150 k
press: 1.00000 atm
elementType: 8 8 8 8 6 6 6 6 6 6 6 6 6 6 1 1 1 1 1 1 1 1 1 1 1 1 1 1 1 1 1 1
symmnumber: 1
zpe: 706659.3 jmol-1
zpe.correction: 0.269152 hartree
zpe.thermalcorrener: 0.285408 hartree
zpe.thermalcorrenthalpy: 0.286352 hartree
zpe.thermalcorrgfe: 0.223162 hartree
zpe.sumelectzpe: -691.619393 hartree
zpe.sumelectthermal: -691.603137 hartree
zpe.sumelectthermalent: -691.602193 hartree
zpe.sumelectthermalfe: -691.665383 hartree
dipole: -0.0320 0.8662 -1.1484
dipole: 1.4388
quadrupole: -68.4830 -82.0200 -90.8990
quadrupole: -6.2791 -1.5274 0.8194
quadrupole: 11.9843 -1.5527 -10.4316 -6.2791 -1.5274 0.8194
hfenergy: -691.8885449 hartree
pointgroup: C01 [X(C10H18O4)]
dipole: -0.0020879 0.4560471 -0.335307 debye
polarizability: 145.6108926|-2.7297323|110.6235047|-3.2434758|6.1935306|105.2803369 unknown
InChI: InChI=1S/C10H18O4/c1-4-12-9(11)5-6-10(3)13-7-8(2)14-10/h8H,4-7H2,1-3H3
charge 0 multiplicity 1
32 atoms
O  -1.8790 0.552612 -0.924354
O  -2.79365 -1.148199 0.458994
O  3.249523 -0.344768 -0.540655
O  2.139089 0.034994 1.476883
C  -1.681641 -0.861498 -0.483481
C  -3.117137 1.076998 -0.277458
C  -0.335549 -0.943239 0.264048
C  -3.259772 0.160715 0.955209
C  -1.829361 -1.814399 -1.668796
C  0.85338 -0.448414 -0.584247
C  -2.928633 2.563985 0.014935
C  2.1018 -0.229218 0.251887
C  4.557664 -0.079448 0.136392
C  4.878649 1.417838 0.130183
H  -3.968468 0.91343 -0.970058
H  -0.1733 -1.988627 0.586053
H  -0.400501 -0.328199 1.179087
H  -2.627464 0.521709 1.792402
H  -4.297856 0.023669 1.295804
H  -2.821398 -1.682673 -2.1305
H  -1.057274 -1.610898 -2.429747
H  -1.731944 -2.860869 -1.330823
H  0.579425 0.524763 -1.039447
H  1.098114 -1.132445 -1.41463
H  -2.735146 3.118787 -0.918939
H  -3.837586 2.985023 0.483328
H  -2.072619 2.720752 0.694423
H  4.505412 -0.474094 1.166426
H  5.279745 -0.660357 -0.459518
H  5.885637 1.585942 0.55563
H  4.867256 1.818757 -0.89809
H  4.150104 1.976869 0.741063
