program: Gaussian 09
title: 000221632
version: EM64L-G09RevD.01
frameworkgroup: C1[X(C10H18O3)]
method: RPBEPBE
basis: SDD
operation: Freq
keyword: #pfreq=noraman
keyword: PBEPBE/SDD
title: #p freq=noraman PBEPBE/SDD
converged: YES YES NO NO
title: Mulliken charges:
elementType: O O O C C C C C C C C C C H H H H H H H H H H H H H H H H H H
charge: -0.283263 -0.260134 -0.259388 -0.019271 -0.474440 -0.442229 -0.423064 -0.425563 0.261707 -0.513188 -0.297156 -0.209411 -0.680540 0.262167 0.219359 0.242620 0.246289 0.207826 0.210934 0.219114 0.217070 0.224702 0.236189 0.259987 0.212739 0.218195 0.191507 0.202642 0.200910 0.227292 0.226396
chargesum: 0.00000
title: Mulliken charges with hydrogens summed into heavy atoms:
elementType: O O O C C C C C C C C C C
charge: -0.283263 -0.260134 -0.259388 0.242896 -0.012460 0.011886 0.006984 0.016209 0.261707 -0.017012 0.133778 0.184738 -0.025942
polarizability: 1.35594879e+02 -3.93657074e+00 1.14119346e+02 1.30891806e+00 2.25681242e+00 9.93043624e+01
1716.lowfreq: -16.7396 -6.8406 -0.0009 -0.0002 0.0006 9.7722 18.2610 20.9513 47.8423
frequency: 15.6774 18.6908 47.3481 66.9430 84.7504 93.6871 100.2752 160.2081 213.7809 220.7396 237.3764 278.5622 309.3464 340.2591 395.1852 427.8117 499.4516 544.0443 580.4085 644.1684 685.5666 762.5591 768.2627 802.6225 820.1995 843.5008 854.6672 892.9844 901.9559 913.0675 935.5542 936.0215 994.8434 1009.9936 1013.7026 1042.1291 1058.0177 1076.1674 1094.5390 1114.6189 1126.7338 1140.3313 1154.5092 1161.5210 1196.1998 1201.5299 1218.9241 1252.0548 1261.6512 1264.6258 1286.0548 1302.8371 1308.3874 1321.8763 1326.9981 1342.3959 1362.9830 1377.9911 1394.1277 1425.3515 1452.5949 1457.0681 1459.4764 1459.6087 1468.3161 1476.6732 1480.5893 1490.5039 1626.5304 2927.1518 2969.5881 2985.9120 2992.1090 2993.1910 2994.2842 2995.5388 3004.0192 3019.0044 3055.8514 3066.0169 3068.5212 3076.6861 3076.8922 3083.9249 3089.0771 3089.9089 3099.6902
redmass: 2.4912 3.8245 3.2091 4.7785 2.3513 2.9602 3.0508 2.9966 2.2827 2.7655 1.3083 3.3138 2.0935 2.9679 3.4003 2.3466 2.5430 2.8580 2.4685 4.1209 2.3505 2.9984 2.8901 2.0236 1.0877 3.2534 2.3510 2.5828 2.6330 2.0463 2.9473 1.4540 2.2338 1.6125 2.2302 2.6315 1.7826 4.4173 1.7863 2.0580 2.1921 1.6969 1.5869 1.5136 1.4976 1.3283 1.3773 1.1656 1.2213 1.2152 1.3248 1.3044 1.2856 1.5365 1.3963 1.5310 1.2241 1.2646 1.2862 1.0965 1.0877 1.0865 1.0758 1.0437 1.0841 1.0537 1.0995 1.0758 9.4740 1.0579 1.0656 1.1033 1.0362 1.0654 1.0646 1.0628 1.0625 1.0628 1.0948 1.0934 1.0993 1.0992 1.1011 1.0957 1.1034 1.0990 1.1010
irintensity: 0.1591 0.1658 0.1611 1.7206 4.6257 0.6793 2.6436 5.9622 1.5017 2.9366 2.1469 5.4319 5.3082 1.1788 8.7232 0.2792 8.6248 6.2799 2.8865 1.8369 0.6314 8.5728 5.8675 7.5243 3.6375 7.2374 14.3010 1.6849 8.5641 16.5878 18.6732 30.4780 28.6752 8.7326 4.7140 34.4069 6.4910 96.6918 22.4012 41.1330 175.6764 107.0144 4.3086 2.3660 3.5918 48.5249 1.3464 4.6528 20.0735 10.4146 0.1232 0.3411 2.1115 1.7775 47.8807 29.5859 10.3467 3.8198 23.0178 28.6306 10.8969 14.8773 9.5094 10.8541 9.7676 8.4794 7.9101 4.2531 149.1091 88.3761 53.3817 35.5046 26.6654 5.2674 24.8931 35.1623 32.1391 28.3283 28.0619 15.3142 17.8406 47.1237 2.3000 9.1997 71.9037 36.3321 39.5316
temp: 298.150 k
press: 1.00000 atm
elementType: 8 8 8 6 6 6 6 6 6 6 6 6 6 1 1 1 1 1 1 1 1 1 1 1 1 1 1 1 1 1 1
symmnumber: 1
zpe: 700924.9 jmol-1
zpe.correction: 0.266968 hartree
zpe.thermalcorrener: 0.281640 hartree
zpe.thermalcorrenthalpy: 0.282584 hartree
zpe.thermalcorrgfe: 0.222097 hartree
zpe.sumelectzpe: -616.471129 hartree
zpe.sumelectthermal: -616.456457 hartree
zpe.sumelectthermalent: -616.455513 hartree
zpe.sumelectthermalfe: -616.516000 hartree
dipole: -2.2890 0.1738 -0.4378
dipole: 2.3369
quadrupole: -78.8312 -74.6547 -83.8163
quadrupole: -1.9886 0.2493 4.2914
quadrupole: 0.2696 4.4460 -4.7155 -1.9886 0.2493 4.2914
hfenergy: -616.738097 hartree
pointgroup: C01 [X(C10H18O3)]
dipole: -0.9098807 0.1204653 -0.0542214 debye
polarizability: 134.992274|-4.3699896|113.7595854|-3.2480553|4.3755834|100.266728 unknown
InChI: InChI=1S/C10H18O3/c1-2-12-8-7-10(11)13-9-5-3-4-6-9/h9H,2-8H2,1H3
charge 0 multiplicity 1
31 atoms
O  -0.779744 -0.823917 -0.421453
O  3.289185 0.029029 -1.042652
O  0.744422 -1.447111 1.236234
C  -1.809902 -0.503068 0.638674
C  -3.190347 -0.557405 -0.065659
C  -1.624859 0.957485 1.106968
C  -3.694219 0.919094 -0.157943
C  -2.425718 1.783909 0.071793
C  0.457555 -1.28902 0.024402
C  1.371686 -1.608563 -1.148987
C  2.86885 -1.359927 -0.848854
C  2.786823 0.96605 -0.022364
C  3.559692 2.2740 -0.190065
H  -1.673087 -1.236577 1.450808
H  -3.895645 -1.200322 0.48947
H  -3.057234 -1.001632 -1.067196
H  -0.560145 1.23393 1.192873
H  -2.078422 1.064879 2.112254
H  -4.432862 1.121259 0.641092
H  -4.186121 1.132467 -1.122842
H  -1.846698 1.870381 -0.867006
H  -2.659395 2.804333 0.422732
H  1.235779 -2.685218 -1.377939
H  1.054783 -1.043385 -2.041537
H  3.097038 -1.698803 0.183885
H  3.486183 -1.92887 -1.563879
H  1.696722 1.136056 -0.165777
H  2.932812 0.532063 0.990117
H  3.200377 3.02996 0.53215
H  4.637987 2.109718 -0.022404
H  3.426202 2.672902 -1.210794
