program: Gaussian 09
title: 000221631
version: EM64L-G09RevD.01
frameworkgroup: C1[X(C10H18O2)]
method: RPBEPBE
basis: SDD
operation: Freq
keyword: #pfreq=noraman
keyword: PBEPBE/SDD
title: #p freq=noraman PBEPBE/SDD
converged: NO YES NO NO
title: Mulliken charges:
elementType: O O C C C C C C C C C C H H H H H H H H H H H H H H H H H H
charge: -0.277763 -0.280678 0.374494 -0.475609 -0.531339 -0.433218 -0.420507 0.014482 0.007405 -0.411869 -0.726696 -0.722046 0.221289 0.219040 0.241638 0.233063 0.217654 0.210972 0.222409 0.208488 0.191731 0.182752 0.192794 0.216380 0.203056 0.231671 0.227774 0.228007 0.232137 0.202488
chargesum: 0.00000
title: Mulliken charges with hydrogens summed into heavy atoms:
elementType: O O C C C C C C C C C C
charge: -0.277763 -0.280678 0.374494 -0.035280 -0.056638 -0.004591 0.010389 0.206212 0.190157 -0.002695 -0.064195 -0.059413
polarizability: 1.27075301e+02 7.89932221e-02 1.09999101e+02 -1.75718131e+00 -1.65570150e-01 9.52701770e+01
1716.lowfreq: -22.5772 -9.1486 -6.4077 -0.0010 -0.0008 -0.0004 27.6144 112.6809 135.5434
frequency: 27.1051 112.6633 135.5344 141.1920 198.4471 206.1085 221.0912 237.7795 262.7681 329.7388 335.9676 401.0080 437.3834 440.7081 464.2374 492.3206 510.1805 554.1490 665.4251 726.5404 760.0581 815.8468 833.4445 849.1472 862.0886 885.0358 908.0868 918.8181 936.5042 941.4877 971.7170 991.3650 1020.3067 1046.8489 1050.0978 1058.7400 1095.2623 1129.7883 1139.5156 1157.1355 1170.2824 1179.9734 1191.7340 1211.9386 1223.4225 1243.2004 1265.9812 1285.5453 1306.0427 1311.0672 1321.4192 1325.9930 1329.8362 1350.5376 1362.6867 1384.9863 1386.7626 1432.2202 1444.4054 1452.9226 1458.2141 1459.4527 1468.7734 1478.4110 1478.9400 1479.0075 2919.2410 2926.7950 2985.6884 2987.9962 2990.2962 2995.0738 2997.1246 3003.3035 3024.6659 3056.1437 3058.3701 3065.5248 3077.8231 3086.3003 3087.4090 3095.8400 3096.5081 3101.2643
redmass: 2.5148 2.8694 2.4995 2.8035 1.0840 1.0963 2.0945 2.4757 2.0714 2.5440 3.8903 3.2416 3.1700 3.0502 3.7921 2.2922 2.5616 2.0765 2.6230 3.7796 2.6736 2.1884 2.4751 2.9056 2.4728 1.7568 2.4795 1.7480 1.5393 1.9778 1.8817 1.3780 2.1210 2.0376 1.7481 1.9933 2.4297 3.0394 1.8412 1.8699 2.4648 1.6393 2.3781 1.3233 1.3664 1.4449 1.2889 1.2792 1.2847 1.3859 1.4014 1.3117 1.2873 1.5344 1.7000 1.2334 1.2978 1.0960 1.0897 1.0828 1.0489 1.0456 1.0846 1.0493 1.1015 1.0507 1.0831 1.0825 1.0499 1.0358 1.0450 1.0595 1.0633 1.0633 1.0630 1.1023 1.0989 1.1016 1.1043 1.0993 1.0992 1.1003 1.1001 1.1034
irintensity: 0.0415 0.6463 3.4779 0.8813 0.3780 0.1494 1.9013 0.9396 1.0085 2.3663 2.8476 0.3350 2.9101 3.4841 1.9948 1.1723 10.0542 1.1643 0.3849 0.0897 24.8394 3.0214 12.7091 11.7055 37.3359 11.6478 0.7639 2.8365 43.8249 8.1379 20.0393 0.7492 50.6172 1.9538 0.1714 51.9397 85.7399 4.4178 0.4108 16.4388 49.9704 31.7164 23.2633 12.6512 4.6487 2.3266 0.7195 4.5927 9.4505 3.4890 34.7855 5.6735 8.7648 7.1978 27.9295 23.0443 14.4311 5.6784 5.5192 15.3639 3.2585 15.5221 9.5296 13.1549 7.8958 1.0450 11.7424 79.2166 3.1758 33.5498 57.8189 36.1072 41.2028 20.9947 13.6343 17.3348 30.3572 37.0786 46.0814 9.8675 57.1137 20.9150 40.3593 26.9853
temp: 298.150 k
press: 1.00000 atm
elementType: 8 8 6 6 6 6 6 6 6 6 6 6 1 1 1 1 1 1 1 1 1 1 1 1 1 1 1 1 1 1
symmnumber: 1
zpe: 692821.8 jmol-1
zpe.correction: 0.263882 hartree
zpe.thermalcorrener: 0.276152 hartree
zpe.thermalcorrenthalpy: 0.277097 hartree
zpe.thermalcorrgfe: 0.225806 hartree
zpe.sumelectzpe: -541.331594 hartree
zpe.sumelectthermal: -541.319324 hartree
zpe.sumelectthermalent: -541.318379 hartree
zpe.sumelectthermalfe: -541.369670 hartree
dipole: -1.0210 0.0093 1.9138
dipole: 2.1691
quadrupole: -67.9358 -75.7550 -74.0301
quadrupole: -0.0848 -1.2289 0.2065
quadrupole: 4.6378 -3.1814 -1.4564 -0.0848 -1.2289 0.2065
hfenergy: -541.5954759 hartree
pointgroup: C01 [X(C10H18O2)]
dipole: 0.4046006 0.0603243 0.7489668 debye
polarizability: 126.6518098|2.7535155|110.4535688|1.3975446|0.4102367|95.2392 unknown
InChI: InChI=1S/C10H18O2/c1-8-7-9(2)12-10(11-8)5-3-4-6-10/h8-9H,3-7H2,1-2H3
charge 0 multiplicity 1
30 atoms
O  0.329847 -1.126468 -0.458124
O  -0.044563 1.27026 -0.465808
C  -0.646108 -0.052885 -0.208057
C  -1.291164 -0.155342 1.217378
C  -1.796144 -0.230841 -1.224936
C  -2.818529 -0.048109 0.967483
C  -3.006608 -0.742363 -0.406061
C  1.574518 -0.98524 0.34052
C  1.208129 1.520436 0.291569
C  2.215304 0.381819 0.024004
C  2.451458 -2.182755 -0.025119
C  1.69982 2.898077 -0.155627
H  -0.920545 0.619101 1.91078
H  -1.051859 -1.147894 1.643346
H  -1.480902 -0.909051 -2.033875
H  -2.009894 0.759997 -1.662902
H  -3.413447 -0.508035 1.776625
H  -3.116313 1.015453 0.890899
H  -3.973918 -0.5044 -0.882286
H  -2.950598 -1.841148 -0.283859
H  1.313271 -1.02325 1.423301
H  0.971959 1.540409 1.380646
H  3.120783 0.530278 0.645054
H  2.514549 0.401347 -1.041328
H  3.400879 -2.157246 0.540507
H  1.929552 -3.127952 0.203786
H  2.683187 -2.170122 -1.104725
H  1.910931 2.893888 -1.239473
H  0.931277 3.664996 0.042655
H  2.623729 3.174844 0.384429
