program: Gaussian 09
title: 000000842
version: EM64L-G09RevD.01
frameworkgroup: C1[X(C8H14N2O5S)]
method: RPBEPBE
basis: SDD
operation: Freq
keyword: #p
keyword: freq=noraman
keyword: PBEPBE/SDD
title: #p freq=noraman PBEPBE/SDD
converged: YES YES NO NO
title: Mulliken charges:
elementType: S O O O O O N N C C C C C C C C H H H H H H H H H H H H H H
charge: -0.011277 -0.272488 -0.415252 -0.440612 -0.232811 -0.211575 -0.411868 -0.597031 -0.402585 -0.535014 -0.153410 -0.110725 0.252803 -0.716673 0.172896 0.186066 0.220707 0.254813 0.243533 0.225169 0.240591 0.292396 0.352109 0.315278 0.301116 0.274538 0.301656 0.102453 0.378514 0.396683
chargesum: 0.00000
title: Mulliken charges with hydrogens summed into heavy atoms:
elementType: S O O O O O N N C C C C C C C C
charge: 0.091177 -0.272488 -0.036738 -0.043929 -0.232811 -0.211575 -0.059759 -0.020838 0.072935 -0.066312 0.087181 0.181671 0.252803 -0.100280 0.172896 0.186066
polarizability: 1.58483595e+02 -6.60201646e+00 1.19057379e+02 4.59332199e+00 8.39680878e+00 1.16104700e+02
1716.lowfreq: -10.8893 -3.2430 -0.0011 -0.0008 0.0003 2.7304 14.9807 18.7035 36.0635
frequency: 14.6233 17.2355 35.8258 45.8885 53.1413 60.6231 76.6335 100.8076 114.3291 160.6449 166.6941 172.3534 198.5801 231.1833 242.5246 282.2955 292.0866 313.2361 334.6338 385.9907 446.5148 490.6918 516.0419 522.2371 553.0207 590.7538 597.7014 611.5984 615.0632 615.5148 650.9807 689.1202 713.5789 715.8139 747.5688 768.9733 821.4776 851.6855 929.7318 944.0099 984.5286 996.7773 1029.5393 1051.7872 1054.4754 1082.3450 1116.3567 1126.9996 1150.1262 1177.9583 1186.6621 1218.3957 1234.7125 1257.8346 1263.4144 1278.3464 1303.7898 1316.2580 1321.4570 1329.4062 1357.0344 1398.6377 1430.5344 1438.8411 1467.0238 1471.9514 1605.8582 1612.1249 1672.9168 1679.9570 2437.1204 2979.1011 2982.9464 2992.5072 3011.3617 3041.2871 3058.1956 3067.2100 3138.9480 3476.4748 3502.7974 3530.8364 3548.8481 3614.0196
redmass: 6.5254 8.4732 6.7815 7.0674 6.8177 8.3386 5.7365 3.8738 5.4236 2.3715 2.5877 1.6027 4.2940 2.5342 1.5207 4.1787 3.2671 3.3102 4.2340 4.2624 3.7990 3.1760 3.5390 3.3888 1.5916 1.6847 2.0258 1.7372 1.8684 2.1542 2.2622 3.8777 2.8524 3.3469 1.4675 2.4971 1.8799 3.0655 2.7895 4.3423 2.4408 2.2227 2.8077 3.1018 3.0593 1.8190 1.6217 2.0940 1.6047 1.6125 1.3015 1.7207 1.2661 1.5472 1.2720 1.4073 1.3025 1.6521 1.2294 1.5259 1.6679 1.7803 1.0806 1.0873 1.0990 2.1231 6.4375 1.2955 3.8067 9.3848 1.0381 1.0810 1.0621 1.0608 1.0833 1.0987 1.0578 1.1034 1.1083 1.0448 1.0638 1.0644 1.0784 1.0991
irintensity: 0.3018 0.9103 1.7025 1.2813 5.0249 1.3028 3.3698 0.6228 3.6702 9.1354 11.7676 21.8957 1.9939 23.7804 41.0450 2.1734 5.2007 3.4028 1.1955 7.4842 11.0150 21.8676 41.5336 68.3389 214.5239 19.0668 46.0474 140.0948 75.7088 112.7088 95.7720 24.3553 43.1838 14.0498 9.7077 7.9327 5.8600 4.4516 7.3700 39.1163 10.1438 75.3618 14.6927 141.1483 105.6579 158.0038 1.5432 8.7103 8.6924 7.1535 15.9133 35.1905 5.3719 3.6731 17.1737 23.2708 12.4104 48.7110 1.5369 11.2681 23.8734 4.8975 27.4020 11.8078 17.1613 401.5318 116.8702 155.6167 153.4089 209.6928 23.4970 13.8369 4.3022 13.8583 31.8738 5.0622 6.1680 32.2139 0.4952 9.4431 21.5223 35.7969 62.2126 10.8344
temp: 298.150 k
press: 1.00000 atm
elementType: 16 8 8 8 8 8 7 7 6 6 6 6 6 6 6 6 1 1 1 1 1 1 1 1 1 1 1 1 1 1
symmnumber: 1
zpe: 596273.3 jmol-1
zpe.correction: 0.227109 hartree
zpe.thermalcorrener: 0.245954 hartree
zpe.thermalcorrenthalpy: 0.246898 hartree
zpe.thermalcorrgfe: 0.175879 hartree
zpe.sumelectzpe: -1195.693213 hartree
zpe.sumelectthermal: -1195.674367 hartree
zpe.sumelectthermalent: -1195.673423 hartree
zpe.sumelectthermalfe: -1195.744442 hartree
dipole: 0.2435 3.2469 0.4316
dipole: 3.2845
quadrupole: -127.4859 -90.4271 -109.3560
quadrupole: -5.6865 -1.3217 4.2554
quadrupole: -18.3963 18.6626 -0.2663 -5.6865 -1.3217 4.2554
hfenergy: -1195.9203212 hartree
pointgroup: C01 [X(C8H14N2O5S1)]
dipole: 0.0450329 -0.5946694 1.1463884 debye
polarizability: 159.4020859|0.2507784|121.781044|-4.2206052|-7.7191226|112.4625446 unknown
InChI: InChI=1S/C8H14N2O5S/c9-4(7(12)13)1-2-6(11)10-5(3-16)8(14)15/h4-5,10,12,14,16H,1-3,9H2
charge 0 multiplicity 1
30 atoms
S  -3.006131 -1.612559 -2.086794
O  -0.502322 1.908582 -0.678992
O  3.482002 -0.989938 1.958987
O  -3.294961 -1.156888 1.721511
O  4.484546 -1.650152 -0.027304
O  -5.082497 -0.07904 0.697962
N  -1.436823 0.035125 0.313571
N  4.632617 1.04581 -0.773352
C  2.13712 0.665646 -0.453182
C  0.996957 0.385065 0.551885
C  3.57877 0.642934 0.164643
C  -2.79942 0.428823 -0.061163
C  -0.356767 0.84555 0.003327
C  -3.110808 0.200503 -1.565002
C  3.916067 -0.764119 0.647804
C  -3.854894 -0.265208 0.796143
H  2.098277 -0.047049 -1.29983
H  1.97488 1.676985 -0.871503
H  1.190221 0.954239 1.484126
H  0.963521 -0.681471 0.840416
H  3.580186 1.310243 1.047233
H  -2.903547 1.521978 0.105225
H  -1.329896 -0.783852 0.915847
H  -2.414329 0.798697 -2.170348
H  -4.148224 0.501161 -1.779502
H  4.456504 1.925431 -1.263154
H  4.9666 0.287998 -1.376045
H  -1.63321 -1.722099 -1.933406
H  3.710358 -1.922863 2.224554
H  -4.017896 -1.605431 2.236744
