program: Gaussian 09
title: 000221629
version: EM64L-G09RevD.01
frameworkgroup: C1[X(C10H14O3)]
method: RPBEPBE
basis: SDD
operation: Freq
keyword: #pfreq=noraman
keyword: PBEPBE/SDD
title: #p freq=noraman PBEPBE/SDD
converged: YES YES NO NO
title: Mulliken charges:
elementType: O O O C C C C C C C C C C H H H H H H H H H H H H H H
charge: -0.248559 -0.240549 -0.200331 -0.395168 0.015374 -0.063336 -0.117631 -0.719583 -0.716011 0.392687 -0.435985 -0.263138 -0.169488 0.232842 0.194312 0.191238 0.233485 0.196291 0.202945 0.231013 0.234784 0.212582 0.244640 0.222068 0.255547 0.251979 0.257994
chargesum: 0.00000
title: Mulliken charges with hydrogens summed into heavy atoms:
elementType: O O O C C C C C C C C C C
charge: -0.248559 -0.240549 -0.200331 0.031986 0.206612 0.170149 0.078660 -0.050841 -0.036722 0.392687 -0.180438 -0.011158 0.088506
polarizability: 1.47959265e+02 -1.31785010e+00 9.62336485e+01 -1.33114221e+00 -7.14391944e+00 9.75986641e+01
1716.lowfreq: -20.5730 -7.2009 -0.0009 -0.0008 -0.0007 3.4911 44.4172 73.6741 88.7104
frequency: 44.2742 73.6582 88.7093 134.8715 154.7818 196.3247 201.9752 224.6930 262.8618 307.5359 339.7911 377.6922 394.5732 441.2582 469.0349 567.5237 594.8103 652.0202 673.3498 732.8598 754.7471 792.1469 815.5933 832.7442 852.9815 873.1218 875.8437 883.2975 891.2289 899.6081 926.6427 973.4614 990.7070 1013.5832 1027.5645 1048.1080 1094.5489 1118.8305 1137.4036 1145.9054 1152.0650 1205.2552 1231.1111 1251.2939 1269.7493 1282.4318 1316.4396 1329.1221 1336.4947 1348.6486 1367.2376 1374.7656 1382.1707 1387.9395 1434.8789 1458.4303 1468.9519 1478.1034 1480.3571 1487.0113 1599.9016 2910.6679 2925.3581 2986.2964 2990.1966 2994.9733 3037.8802 3062.7291 3079.2667 3089.7779 3095.9049 3099.9536 3219.1937 3234.4874 3268.6722
redmass: 4.3495 4.0494 4.3982 3.1049 2.8710 1.0779 1.1258 3.6263 3.1484 3.2789 3.9642 3.7510 3.8380 3.6049 2.3735 4.4341 2.9697 4.2332 3.8650 1.2633 3.7788 2.7318 1.6812 2.5564 3.7193 2.0518 3.2290 3.1523 2.8634 2.2827 2.2178 2.6587 1.9638 1.5644 1.3579 2.5415 2.6932 1.9326 1.6307 1.9073 2.5222 1.4514 1.3979 3.4301 1.2941 1.2593 1.2865 1.4649 1.2440 1.5255 1.6853 1.9403 1.2335 1.2838 1.0937 1.0470 1.0575 1.0530 1.0823 3.9823 6.7992 1.0826 1.0825 1.0376 1.0385 1.0561 1.0884 1.1017 1.0981 1.0992 1.0998 1.1003 1.0928 1.0983 1.1083
irintensity: 0.2353 2.7259 3.7572 1.0731 1.2706 0.0418 0.0894 0.5709 0.6524 0.7208 0.9885 6.1715 3.2104 1.5510 3.4381 3.4156 6.1120 1.7601 3.4353 80.6016 0.9514 27.8244 50.0742 14.4828 21.5936 31.5364 12.8471 82.6507 28.3829 5.1864 22.3044 71.7506 39.6944 29.5611 3.9388 7.7132 81.1875 71.0461 20.3147 10.0974 10.5709 1.6424 26.5017 18.4776 34.7631 1.7769 28.2884 28.6666 3.5556 9.2374 7.1256 18.1309 30.5426 20.9674 9.0170 8.1461 11.7051 9.9749 4.4069 12.5747 11.3580 48.5116 62.0649 20.7663 13.1191 40.7605 19.2678 21.9426 50.4436 32.1073 26.5047 30.1554 4.3499 0.6379 0.8003
temp: 298.150 k
press: 1.00000 atm
elementType: 8 8 8 6 6 6 6 6 6 6 6 6 6 1 1 1 1 1 1 1 1 1 1 1 1 1 1
symmnumber: 1
zpe: 583289.5 jmol-1
zpe.correction: 0.222163 hartree
zpe.thermalcorrener: 0.234638 hartree
zpe.thermalcorrenthalpy: 0.235582 hartree
zpe.thermalcorrgfe: 0.183246 hartree
zpe.sumelectzpe: -614.083849 hartree
zpe.sumelectthermal: -614.071374 hartree
zpe.sumelectthermalent: -614.070429 hartree
zpe.sumelectthermalfe: -614.122766 hartree
dipole: 1.8979 -0.8057 1.6956
dipole: 2.6695
quadrupole: -60.8484 -80.1238 -75.0862
quadrupole: -1.2548 -0.8587 -2.9352
quadrupole: 11.1711 -8.1043 -3.0668 -1.2548 -0.8587 -2.9352
hfenergy: -614.3060118 hartree
pointgroup: C01 [X(C10H14O3)]
dipole: 0.7413861 -0.2854168 0.6869791 debye
polarizability: 147.9977312|-0.898099|95.6673407|-0.6805749|-7.0897014|98.1265053 unknown
InChI: InChI=1S/C10H14O3/c1-7-6-8(2)13-10(12-7)9-4-3-5-11-9/h3-5,7-8,10H,6H2,1-2H3
charge 0 multiplicity 1
27 atoms
O  0.609491 1.118358 0.202448
O  0.507315 -1.161809 -0.630953
O  -1.976554 0.37305 -1.008031
C  2.66361 0.071577 -0.67961
C  2.08979 1.050129 0.367576
C  1.992396 -1.321411 -0.587601
C  0.008299 -0.210221 0.366702
C  2.600606 2.481711 0.213468
C  2.439372 -2.166611 0.622572
C  -1.467505 -0.097133 0.217472
C  -2.514954 -0.369357 1.082258
C  -3.741555 -0.059043 0.378743
C  -3.372953 0.388383 -0.87898
H  2.474377 0.494123 -1.68351
H  3.758488 -0.028965 -0.546477
H  2.304203 0.678482 1.396438
H  2.194552 -1.891002 -1.511753
H  0.244519 -0.584205 1.390609
H  3.698657 2.518257 0.334582
H  2.341274 2.871407 -0.786334
H  2.138896 3.139164 0.969707
H  2.351692 -1.625738 1.581459
H  1.828383 -3.08353 0.68315
H  3.497658 -2.463583 0.502102
H  -2.423497 -0.745791 2.099315
H  -4.7569 -0.154511 0.757366
H  -3.920257 0.733471 -1.751418
